Showing test failures in reverse-chronological order. next page
timestamp waterfall builder build log
April 23, 2013, 3:48 p.m. http://build.chromium.org/p/chromium.win/json Vista Tests (1) 36466
[5116:4756:0423/083119:1155062:ERROR:child_process_launcher.cc(326)] Failed to launch child process
[5116:3264:0423/083119:1155203:ERROR:child_process_launcher.cc(326)] Failed to launch child process
[5116:3264:0423/083119:1155265:ERROR:child_process_launcher.cc(326)] Failed to launch child process
[5116:3264:0423/083124:1160109:ERROR:textfield.h(162)] NOT IMPLEMENTED
[0423/083149:ERROR:test_launcher.cc(365)] Test timeout (30000 ms) exceeded for MetricsServiceTest.CrashRenderers
Note: Google Test filter = BrowserTest.ThirtyFourTabs
[==========] Running 1 test from 1 test case.
[----------] Global test environment set-up.
[----------] 1 test from BrowserTest, where TypeParam = 

[ 40/878]  63.13s PrerenderBrowserTest.PrerenderSessionStorage (30.16s)
[----------] 1 test from AppBackgroundPageApiTest (1276 ms total)

[----------] Global test environment tear-down
[==========] 1 test from 1 test case ran. (1276 ms total)
[  PASSED  ] 0 tests.
[  FAILED  ] 1 test, listed below:
[  FAILED  ] AppBackgroundPageApiTest.NoJsBackgroundPage, where TypeParam =  and GetParam() = 

 1 FAILED TEST
Note: Google Test filter = PrerenderBrowserTest.PrerenderSessionStorage
[==========] Running 1 test from 1 test case.
[----------] Global test environment set-up.
[----------] 1 test from PrerenderBrowserTest, where TypeParam =
full log
April 23, 2013, 11:56 a.m. http://build.chromium.org/p/chromium.memory/json Mac ASAN Tests (2) 10240
dyld: warning, unknown environment variable: DYLD_NO_PIE
dyld: warning, unknown environment variable: DYLD_NO_PIE
=================================================================
==17584==ERROR: AddressSanitizer: heap-buffer-overflow on address 0x40c4a638 at pc 0x147e6fcc bp 0xbff32b28 sp 0xbff3270 (truncated by parser)
READ of size 16 at 0x40c4a638 thread T0
    #0 0x147e6fcb in wrap_memcpy (in libclang_rt.asan_osx_dynamic.dylib) + 363
    #1 0x9005dfc6 in 0x0001cfc6 (in OpenCL) + 520
    #2 0x9005e0fb in 0x0001d0fb (in OpenCL) + 101
    #3 0x9005c49b in clEnqueueNDRangeKernel (in OpenCL) + 181
    #4 0x91702b4e in -[FEOpenCLContext _quad:] (in CoreImage) + 3776
    #5 0x9181179b in -[FEContext(Drawing) quad:kernel:] (in CoreImage) + 105
    #6 0x9173f364 in FEApplyTreeNode::render1(FETreeContext*, FEShape const&, fe_kernel_target_struct*, int, float*, FET (truncated by parser)
    #7 0x9173fb82 in FEApplyTreeNode::render2(FETreeContext*, FEShape const*, void (*)(FEContext*, void*, FEFormat), voi (truncated by parser)
    #8 0x9173cdea in FETreeNode::render_(FETreeContext*, FEShape const*, void (*)(FEContext*, void*, FEFormat), void (*) (truncated by parser)
    #9 0x9173cfb2 in FETreeNode::renderTexture(void*, CGRect, FEFormat, void (*)(FEContext*, void*, FEFormat), void (*)( (truncated by parser)
    #10 0x91737792 in FETexture::retainTextureObject(FETextureCache*, FEContext*, unsigned int, void*, void (*)(void*, C (truncated by parser)
    #11 0x91738111 in FETexture::newTexture(FEContext*, fe_texture_params_struct const*, void*, void (*)(void*, CGRect,  (truncated by parser)
    #12 0x9173d346 in FETreeNode::createTexture(FETreeContext*, unsigned int, unsigned int, bool, bool, FETreeTexture*,  (truncated by parser)
    #13 0x9173f7fc in FEApplyTreeNode::render2(FETreeContext*, FEShape const*, void (*)(FEContext*, void*, FEFormat), vo (truncated by parser)
    #14 0x9173cdea in FETreeNode::render_(FETreeContext*, FEShape const*, void (*)(FEContext*, void*, FEFormat), void (* (truncated by parser)
    #15 0x917407fe in FETreeNode::render(FETreeContext*, FEShape const&, void (*)(FEContext*, void*, FEFormat), void (*) (truncated by parser)
    #16 0x91740797 in FETreeContext::render(FETreeNode*, FEShape const&, void (*)(FEContext*, void*, FEFormat), void (*) (truncated by parser)

(trimmed by parser)

  0x281894e0: fa fa 00 04 fa fa 00 00 fa fa 00 00 fa fa 00 00
  0x281894f0: fa fa 00 00 fa fa 00 00 fa fa 00 00 fa fa 00 00
  0x28189500: fa fa 00 00 fa fa 00 00 fa fa 00 00 fa fa fd fd
  0x28189510: fa fa fd fd fa fa fd fd fa fa fd fd fa fa fd fd
Shadow byte legend (one shadow byte represents 8 application bytes):
  Addressable:           00
  Partially addressable: 01 02 03 04 05 06 07
  Heap left redzone:     fa
  Heap righ redzone:     fb
  Freed Heap region:     fd
  Stack left redzone:    f1
  Stack mid redzone:     f2
  Stack right redzone:   f3
  Stack partial redzone: f4
  Stack after return:    f5
  Stack use after scope: f8
  Global redzone:        f9
  Global init order:     f6
  Poisoned by user:      f7
  ASan internal:         fe
==17584==ABORTING

[122/911] 688.91s BrowserNavigatorTest.NavigateFromPageToOptionsInNewTab (0.28s)
full log
April 23, 2013, 11:11 a.m. http://build.chromium.org/p/chromium.memory/json Mac ASAN Tests (2) 10239
dyld: warning, unknown environment variable: DYLD_NO_PIE
dyld: warning, unknown environment variable: DYLD_NO_PIE
=================================================================
==16349==ERROR: AddressSanitizer: heap-buffer-overflow on address 0x40e4c7d8 at pc 0x147bdfcc bp 0xbff5ab48 sp 0xbff5a72 (truncated by parser)
READ of size 16 at 0x40e4c7d8 thread T0
    #0 0x147bdfcb in wrap_memcpy (in libclang_rt.asan_osx_dynamic.dylib) + 363
    #1 0x9005dfc6 in 0x0001cfc6 (in OpenCL) + 520
    #2 0x9005e0fb in 0x0001d0fb (in OpenCL) + 101
    #3 0x9005c49b in clEnqueueNDRangeKernel (in OpenCL) + 181
    #4 0x91702b4e in -[FEOpenCLContext _quad:] (in CoreImage) + 3776
    #5 0x9181179b in -[FEContext(Drawing) quad:kernel:] (in CoreImage) + 105
    #6 0x9173f364 in FEApplyTreeNode::render1(FETreeContext*, FEShape const&, fe_kernel_target_struct*, int, float*, FET (truncated by parser)
    #7 0x9173fb82 in FEApplyTreeNode::render2(FETreeContext*, FEShape const*, void (*)(FEContext*, void*, FEFormat), voi (truncated by parser)
    #8 0x9173cdea in FETreeNode::render_(FETreeContext*, FEShape const*, void (*)(FEContext*, void*, FEFormat), void (*) (truncated by parser)
    #9 0x9173cfb2 in FETreeNode::renderTexture(void*, CGRect, FEFormat, void (*)(FEContext*, void*, FEFormat), void (*)( (truncated by parser)
    #10 0x91737792 in FETexture::retainTextureObject(FETextureCache*, FEContext*, unsigned int, void*, void (*)(void*, C (truncated by parser)
    #11 0x91738111 in FETexture::newTexture(FEContext*, fe_texture_params_struct const*, void*, void (*)(void*, CGRect,  (truncated by parser)
    #12 0x9173d346 in FETreeNode::createTexture(FETreeContext*, unsigned int, unsigned int, bool, bool, FETreeTexture*,  (truncated by parser)
    #13 0x9173f7fc in FEApplyTreeNode::render2(FETreeContext*, FEShape const*, void (*)(FEContext*, void*, FEFormat), vo (truncated by parser)
    #14 0x9173cdea in FETreeNode::render_(FETreeContext*, FEShape const*, void (*)(FEContext*, void*, FEFormat), void (* (truncated by parser)
    #15 0x917407fe in FETreeNode::render(FETreeContext*, FEShape const&, void (*)(FEContext*, void*, FEFormat), void (*) (truncated by parser)
    #16 0x91740797 in FETreeContext::render(FETreeNode*, FEShape const&, void (*)(FEContext*, void*, FEFormat), void (*) (truncated by parser)

(trimmed by parser)

  Partially addressable: 01 02 03 04 05 06 07
  Heap left redzone:     fa
  Heap righ redzone:     fb
  Freed Heap region:     fd
  Stack left redzone:    f1
  Stack mid redzone:     f2
  Stack right redzone:   f3
  Stack partial redzone: f4
  Stack after return:    f5
  Stack use after scope: f8
  Global redzone:        f9
  Global init order:     f6
  Poisoned by user:      f7
  ASan internal:         fe
==16349==ABORTING
dyld: warning, unknown environment variable: DYLD_NO_PIE
dyld: warning, unknown environment variable: DYLD_NO_PIE
Note: Google Test filter = SessionRestoreTest.ActiveIndexUpdatedAtClose
[==========] Running 1 test from 1 test case.
[----------] Global test environment set-up.
[----------] 1 test from SessionRestoreTest, where TypeParam =

[109/898] 598.33s SessionRestoreTest.ActiveIndexUpdatedAtClose (0.00s)
full log
April 17, 2013, 8:36 p.m. http://build.chromium.org/p/chromium.win/json Win7 Tests (1) 21546
[4620:6068:0417/132829:2578415:WARNING:chrome_browser_main_win.cc(293)] Command line too long for RegisterApplicationRes (truncated by parser)
[4620:6068:0417/132829:2578415:WARNING:status_icon_win.cc(33)] Unable to create status tray icon.
[4620:6068:0417/132830:2578431:WARNING:status_icon_win.cc(94)] Error setting status tray icon image
[4620:6068:0417/132830:2578431:WARNING:status_icon_win.cc(110)] Unable to set tooltip for status tray icon
[0417/132859:ERROR:test_launcher.cc(365)] Test timeout (30000 ms) exceeded for MetricsServiceTest.CrashRenderers
Note: Google Test filter = TranslateManagerBrowserTest.MultipleOnPageContents
[==========] Running 1 test from 1 test case.
[----------] Global test environment set-up.
[----------] 1 test from TranslateManagerBrowserTest

[ 684/1139] 1076.40s TranslateManagerBrowserTest.MultipleOnPageContents (0.05s)
[ 685/1140] 1077.85s TabCaptureApiTest.ApiTests (30.09s) - retry #1
Note: Google Test filter = TabCaptureApiTest.ApiTests
[==========] Running 1 test from 1 test case.
[----------] Global test environment set-up.
[----------] 1 test from TabCaptureApiTest, where TypeParam =
full log
April 17, 2013, 2:37 a.m. http://build.chromium.org/p/chromium.win/json Win7 Tests (dbg)(5) 17583
[0416/192252:ERROR:logging_chrome.cc(321)] Unable to initialize logging to E:\b\build\slave\Win7_Tests__dbg__5_\build\sr (truncated by parser)
Assertion failed: ptr_ != NULL, file ..\base/memory/ref_counted.h, line 256
[3724:2748:0416/192252:2063690:WARNING:chrome_browser_main_win.cc(293)] Command line too long for RegisterApplicationRes (truncated by parser)
[0416/192253:ERROR:gl_surface_egl.cc(98)] eglInitialize failed with error UNKNOWN
[0416/192253:ERROR:gl_surface_win.cc(54)] GLSurfaceEGL::InitializeOneOff failed.
[0416/192253:ERROR:dxva_video_decode_accelerator.cc(396)] Direct3DCreate9Ex failed, HRESULT: 0x8876086a
[0416/192253:ERROR:dxva_video_decode_accelerator.cc(389)] Failed to initialize D3D device and manager
[3724:2748:0416/192257:2068760:ERROR:textfield.h(162)] NOT IMPLEMENTED
Assertion failed: ptr_ != NULL, file ..\base/memory/ref_counted.h, line 256
[0416/192336:ERROR:test_launcher.cc(365)] Test timeout (45000 ms) exceeded for MetricsServiceTest.CrashRenderers
Starting tests...
IMPORTANT DEBUGGING NOTE: each test is run inside its own process.
For debugging a test inside a debugger, use the
--gtest_filter=<your_test_name> flag along with either
--single_process (to run the test in one launcher/browser process) or
--single-process (to do the above, and also run Chrome in single-process mode).
More than 5 timeouts, aborting test case
More than 5 timeouts, aborting test
9 tests run
6 tests failed (0 ignored)
Failing tests:
EditDictionaryWebUITest.testRemoveNotification
DownloadTest.DownloadTest_CrazyFilenames
ExtensionInstallUIBrowserTest.TestThemeReset
SyncFileSystemApiTest.OnFileStatusChangedDeleted
PrerenderBrowserTest.PrerenderServerRedirectNavigateToSecond
MetricsServiceTest.CrashRenderers

[172/667] 1642.44s ExtensionWebstorePrivateBundleTest.InstallBundleInvalid (48.19s)
full log
April 17, 2013, 2:12 a.m. http://build.chromium.org/p/chromium.win/json Win7 Tests (3) 19409
[3308:1216:0416/190111:910125:WARNING:chrome_browser_main_win.cc(293)] Command line too long for RegisterApplicationRest (truncated by parser)
Backtrace:
	predictors::PredictorTableBase::Initialize [0x016EE9ED+93]
	predictors::PredictorDatabaseInternal::Initialize [0x0156F5D9+137]
	base::MessageLoop::RunTask [0x018AC9BF+831]
	base::MessageLoop::DoWork [0x018AECCA+1210]
	base::MessagePumpDefault::Run [0x018EAB3D+285]
	base::MessageLoop::RunInternal [0x018AE03D+157]
	base::RunLoop::Run [0x018B0EB3+19]
	base::Thread::Run [0x018B069B+11]
	content::BrowserThreadImpl::DBThreadRun [0x02DBD105+37]
	content::BrowserThreadImpl::Run [0x02DBDFC7+87]
	base::Thread::ThreadMain [0x018B0798+216]
	base::`anonymous namespace'::ThreadFunc [0x018BE2EA+26]
	BaseThreadInitThunk [0x764B339A+18]
	RtlInitializeExceptionChain [0x77079EF2+99]
	RtlInitializeExceptionChain [0x77079EC5+54]
Note: Google Test filter = PolicyPrefsTestInstance/PolicyPrefsTest.CheckPolicyIndicators/21
[==========] Running 1 test from 1 test case.
[----------] Global test environment set-up.
[----------] 1 test from PolicyPrefsTestInstance/PolicyPrefsTest

[ 27/873]   6.76s PolicyPrefsTestInstance/PolicyPrefsTest.CheckPolicyIndicators/21 (0.30s)
full log
April 17, 2013, 2:10 a.m. http://build.chromium.org/p/chromium.win/json XP Tests (dbg)(5) 28774
Assertion failed: ptr_ != NULL, file ..\base/memory/ref_counted.h, line 256
[2200:3172:0416/185438:2341890:ERROR:textfield.h(162)] NOT IMPLEMENTED
Assertion failed: ptr_ != NULL, file ..\base/memory/ref_counted.h, line 256
[0416/185515:ERROR:test_launcher.cc(365)] Test timeout (45000 ms) exceeded for MetricsServiceTest.CrashRenderers
Starting tests...
IMPORTANT DEBUGGING NOTE: each test is run inside its own process.
For debugging a test inside a debugger, use the
--gtest_filter=<your_test_name> flag along with either
--single_process (to run the test in one launcher/browser process) or
--single-process (to do the above, and also run Chrome in single-process mode).
More than 5 timeouts, aborting test case
More than 5 timeouts, aborting test
9 tests run
6 tests failed (0 ignored)
Failing tests:
EditDictionaryWebUITest.testRemoveNotification
DownloadTest.DownloadTest_CrazyFilenames
ExtensionInstallUIBrowserTest.TestThemeReset
SyncFileSystemApiTest.OnFileStatusChangedDeleted
PrerenderBrowserTest.PrerenderServerRedirectNavigateToSecond
MetricsServiceTest.CrashRenderers

[180/675] 1674.13s PolicyPrefsTestInstance/PolicyPrefsTest.CheckPolicyIndicators/21 <unknown>
[181/676] 1705.05s PrintPreviewWebUITest.TestColorSettingsTrue (47.69s)
Note: Google Test filter = PrintPreviewWebUITest.TestColorSettingsTrue
[==========] Running 1 test from 1 test case.
[----------] Global test environment set-up.
[----------] 1 test from PrintPreviewWebUITest, where TypeParam =
full log
April 17, 2013, 1:58 a.m. http://build.chromium.org/p/chromium.win/json Vista Tests (3) 29888
Backtrace:
	predictors::PredictorTableBase::Initialize [0x01ACE9ED+93]
	predictors::PredictorDatabaseInternal::Initialize [0x0194F5D9+137]
	base::MessageLoop::RunTask [0x01C8C9BF+831]
	base::MessageLoop::DoWork [0x01C8ECCA+1210]
	base::MessagePumpDefault::Run [0x01CCAB3D+285]
	base::MessageLoop::RunInternal [0x01C8E03D+157]
	base::RunLoop::Run [0x01C90EB3+19]
	base::Thread::Run [0x01C9069B+11]
	content::BrowserThreadImpl::DBThreadRun [0x0319D105+37]
	content::BrowserThreadImpl::Run [0x0319DFC7+87]
	base::Thread::ThreadMain [0x01C90798+216]
	base::`anonymous namespace'::ThreadFunc [0x01C9E2EA+26]
	BaseThreadInitThunk [0x7571F271+14]
	RtlCreateUserProcess [0x7735D819+140]
	RtlCreateProcessParameters [0x7735DA2B+78]
Note: Google Test filter = PolicyPrefsTestInstance/PolicyPrefsTest.CheckPolicyIndicators/21
[==========] Running 1 test from 1 test case.
[----------] Global test environment set-up.
[----------] 1 test from PolicyPrefsTestInstance/PolicyPrefsTest

[ 62/905]   6.69s ClickModifierTest.WindowOpenControlClickTest (0.47s)
full log
April 17, 2013, 1:41 a.m. http://build.chromium.org/p/chromium.memory/json Mac ASAN Tests (2) 9894
ASAN:SIGSEGV
=================================================================
==3271== ERROR: AddressSanitizer: SEGV on unknown address 0x0000000c (pc 0x0970d8c1 sp 0xb229ba60 bp 0xb229bbd8 T12)
AddressSanitizer can not provide additional info.
    #0 0x970d8c0 in predictors::IsSpeculativeResourcePrefetchingEnabled(Profile*, predictors::ResourcePrefetchPredictorC (truncated by parser)
    #1 0x970bebd in predictors::PredictorDatabase::~PredictorDatabase() (in browser_tests) + 189
    #2 0x970d456 in predictors::IsSpeculativeResourcePrefetchingEnabled(Profile*, predictors::ResourcePrefetchPredictorC (truncated by parser)
    #3 0x68c588d in base::MessageLoop::DoWork() (in browser_tests) + 1501
    #4 0x68c6e27 in base::MessageLoop::DoDelayedWork(base::TimeTicks*) (in browser_tests) + 3479
    #5 0x68d1f7d in base::SampleMap::AddSubtractImpl(base::SampleCountIterator*, base::HistogramSamples::Operator) (in b (truncated by parser)
    #6 0x68c408d in base::MessageLoop::RunTask(base::PendingTask const&) (in browser_tests) + 1357
    #7 0x69199d4 in base::SequencedTaskRunner::DeleteSoonInternal(tracked_objects::Location const&, void (*)(void const* (truncated by parser)
    #8 0x68c28e1 in base::MessageLoop::RemoveTaskObserver(base::MessageLoop::TaskObserver*) (in browser_tests) + 193
    #9 0x6965b40 in base::ThreadIdNameManager::GetName(int) (in browser_tests) + 208
    #10 0x861f554 in content::BrowserThreadImpl::Run(base::MessageLoop*) (in browser_tests) + 516
    #11 0x862043d in content::BrowserThread::IsMessageLoopValid(content::BrowserThread::ID) (in browser_tests) + 157
    #12 0x6965dea in base::ThreadIdNameManager::RemoveName(int) (in browser_tests) + 90
    #13 0x6955336 in base::SequencedWorkerPool::Worker::Worker(scoped_refptr<base::SequencedWorkerPool> const&, int, std (truncated by parser)
    #14 0xe57d326 in __asan_mach_override_ptr_custom (in browser_tests) + 1014
    #15 0x96f90d4d in thread_start (in libsystem_c.dylib) + 33
Thread T12 created by T0 here:
    #0 0xe573676 in wrap_strncat (in browser_tests) + 150

(trimmed by parser)

    #17 0x63ef487 in content::LaunchTests(content::TestLauncherDelegate*, int, char**) (in browser_tests) + 7959
    #18 0x27a811b in std::_Rb_tree<std::string, std::pair<std::string const, std::string>, std::_Select1st<std::pair<std (truncated by parser)
    #19 0xf4d14 in apps::PlatformAppBrowserTest_RunningAppsAreRecorded_Test::RunTestOnMainThread() (in browser_tests) +  (truncated by parser)
    #21 0x8
Stats: 10M malloced (17M for red zones) by 136163 calls
Stats: 0M realloced by 119 calls
Stats: 6M freed by 79461 calls
Stats: 0M really freed by 0 calls
Stats: 35M (9107 full pages) mmaped in 70 calls
  mmaps   by size class: 7:126945; 8:18423; 9:4092; 10:2555; 11:510; 12:256; 13:192; 14:96; 15:80; 16:24; 17:4; 18:2; 20 (truncated by parser)
  mallocs by size class: 7:118127; 8:13963; 9:1816; 10:1522; 11:299; 12:157; 13:139; 14:45; 15:73; 16:19; 17:1; 18:1; 20 (truncated by parser)
  frees   by size class: 7:68522; 8:8288; 9:957; 10:1144; 11:227; 12:130; 13:105; 14:10; 15:63; 16:15;
  rfrees  by size class:
Stats: malloc large: 116 small slow: 849
==3271== ABORTING
dyld: warning, unknown environment variable: DYLD_NO_PIE
Note: Google Test filter = WebSocketBrowserTest.SecureWebSocketSplitRecords
[==========] Running 1 test from 1 test case.
[----------] Global test environment set-up.
[----------] 1 test from WebSocketBrowserTest, where TypeParam =

[ 73/846] 325.22s FormAutofillTest.WebFormControlElementToFormFieldInvalidType (19.91s)
[ 74/847] 325.23s WebSocketBrowserTest.SecureWebSocketSplitRecords (20.99s)
full log
March 25, 2013, 8:45 p.m. http://build.chromium.org/p/chromium.win/json XP Tests (dbg)(5) 27884
[1904:840:0325/132735:1509468:ERROR:textfield.h(162)] NOT IMPLEMENTED
[0325/132810:ERROR:test_launcher.cc(365)] Test timeout (45000 ms) exceeded for MetricsServiceTest.CrashRenderers

[287/501] 997.85s WebUIAccessibilityAuditBrowserTest_TestsDisabledInFixture.testWithAuditFailures_a11yChecksNotEnabled ( (truncated by parser)
full log
March 5, 2013, 11:01 p.m. http://build.chromium.org/p/chromium.win/json Win7 Tests (1) 20323
[0305/145652:ERROR:test_launcher.cc(365)] Test timeout (30000 ms) exceeded for MetricsServiceTest.CrashRenderers
Starting tests...
IMPORTANT DEBUGGING NOTE: each test is run inside its own process.
For debugging a test inside a debugger, use the
--gtest_filter=<your_test_name> flag along with either
--single_process (to run the test in one launcher/browser process) or
--single-process (to do the above, and also run Chrome in single-process mode).
1 test run
1 test failed (0 ignored)
Failing tests:
MetricsServiceTest.CrashRenderers

[319/982] 773.56s CalculatorBrowserTest.Model (30.09s)
Note: Google Test filter = CalculatorBrowserTest.Model
[==========] Running 1 test from 1 test case.
[----------] Global test environment set-up.
[----------] 1 test from CalculatorBrowserTest, where TypeParam =
full log
March 5, 2013, 2:01 p.m. http://build.chromium.org/p/chromium.win/json Win7 Tests (1) 20306
[0305/060027:ERROR:test_launcher.cc(365)] Test timeout (30000 ms) exceeded for MetricsServiceTest.CrashRenderers
Starting tests...
IMPORTANT DEBUGGING NOTE: each test is run inside its own process.
For debugging a test inside a debugger, use the
--gtest_filter=<your_test_name> flag along with either
--single_process (to run the test in one launcher/browser process) or
--single-process (to do the above, and also run Chrome in single-process mode).
1 test run
1 test failed (0 ignored)
Failing tests:
MetricsServiceTest.CrashRenderers

[ 271/1080] 966.84s PrefsTabHelperBrowserTest2.GlobalPrefsAreMigrated (30.08s) - retry #1
Note: Google Test filter = PrefsTabHelperBrowserTest2.GlobalPrefsAreMigrated
[==========] Running 1 test from 1 test case.
[----------] Global test environment set-up.
[----------] 1 test from PrefsTabHelperBrowserTest2, where TypeParam =
full log
Feb. 25, 2013, 8:02 p.m. http://build.chromium.org/p/chromium.win/json XP Tests (2) 25239
Backtrace:
	RelaunchChromeBrowserWithNewCommandLineIfNeeded [0x00F83686+4209974]
	RelaunchChromeBrowserWithNewCommandLineIfNeeded [0x00CF332F+1522143]
	RelaunchChromeBrowserWithNewCommandLineIfNeeded [0x00CF563A+1531114]
	RelaunchChromeBrowserWithNewCommandLineIfNeeded [0x00D263DA+1731210]
	RelaunchChromeBrowserWithNewCommandLineIfNeeded [0x00CF479D+1527373]
	RelaunchChromeBrowserWithNewCommandLineIfNeeded [0x00CF7A93+1540419]
	RelaunchChromeBrowserWithNewCommandLineIfNeeded [0x00CF728B+1538363]
	ovly_debug_event [0x01FDA7E5+13825109]
	ovly_debug_event [0x01FDB3B3+13828131]
	RelaunchChromeBrowserWithNewCommandLineIfNeeded [0x00CF7361+1538577]
	RelaunchChromeBrowserWithNewCommandLineIfNeeded [0x00D03F5A+1590794]
	GetModuleFileNameA [0x7C80B729+442]
Starting tests...
IMPORTANT DEBUGGING NOTE: each test is run inside its own process.
For debugging a test inside a debugger, use the
--gtest_filter=<your_test_name> flag along with either
--single_process (to run the test in one launcher/browser process) or
--single-process (to do the above, and also run Chrome in single-process mode).
1 test run
1 test failed (0 ignored)
Failing tests:
MetricsServiceTest.CrashRenderers

[ 518/1045] 283.46s PPAPITest.Flash_SetInstanceAlwaysOnTop (1.08s)
Note: Google Test filter = PPAPITest.Flash_SetInstanceAlwaysOnTop
[==========] Running 1 test from 1 test case.
[----------] Global test environment set-up.
[----------] 1 test from PPAPITest, where TypeParam =
full log
Feb. 23, 2013, 5 a.m. http://build.chromium.org/p/chromium.win/json XP Tests (dbg)(4) 29786
[2116:320:0222/205142:2649218:FATAL:file_stream_context_win.cc(205)] Check failed: !callback_.is_null(). 
Backtrace:
	base::SparseHistogram::HasConstructionArguments [0x07AF5CE1+2186555]
	base::SparseHistogram::HasConstructionArguments [0x07984E3E+675480]
	net::FtpNetworkTransaction::DoDataConnect [0x09AA3F2D+6750528]
	base::SparseHistogram::HasConstructionArguments [0x07960C9E+527608]
	base::SparseHistogram::HasConstructionArguments [0x0796083F+526489]
	base::SparseHistogram::HasConstructionArguments [0x0795E102+516444]
	base::SparseHistogram::HasConstructionArguments [0x078F659C+91638]
	base::SparseHistogram::HasConstructionArguments [0x0794EEA9+454403]
	base::SparseHistogram::HasConstructionArguments [0x0794EBFE+453720]
	base::SparseHistogram::HasConstructionArguments [0x07923EC9+278307]
	base::SparseHistogram::HasConstructionArguments [0x0794DED1+450347]
	base::SparseHistogram::HasConstructionArguments [0x07AC85F6+2000464]
	TextInputClientMsg_CharacterIndexForPoint::operator= [0x0B7FCA17+6061978]
	TextInputClientMsg_CharacterIndexForPoint::operator= [0x0B7FCC2F+6062514]
	base::SparseHistogram::HasConstructionArguments [0x07AC887E+2001112]
	base::SparseHistogram::HasConstructionArguments [0x07AC4C8F+1985769]
	GetModuleFileNameA [0x7C80B729+442]

[2116:320:0222/205142:2649218:FATAL:file_stream_context_win.cc(205)] Check failed: !callback_.is_null(). 
Backtrace:

(trimmed by parser)

	TextInputClientMsg_CharacterIndexForPoint::operator= [0x0B7FCC2F+6062514]
	base::SparseHistogram::HasConstructionArguments [0x07AC887E+2001112]
	base::SparseHistogram::HasConstructionArguments [0x07AC4C8F+1985769]
	GetModuleFileNameA [0x7C80B729+442]

Starting tests...
IMPORTANT DEBUGGING NOTE: each test is run inside its own process.
For debugging a test inside a debugger, use the
--gtest_filter=<your_test_name> flag along with either
--single_process (to run the test in one launcher/browser process) or
--single-process (to do the above, and also run Chrome in single-process mode).
1 test run
1 test failed (0 ignored)
Failing tests:
MetricsServiceTest.CrashRenderers

[280/595] 951.25s WebUIAssertionsTestFail.testAssertFailFails (11.67s)
[281/595] 956.60s PPAPITest.FileIO_Open (13.03s)
[282/596] 957.41s DownloadTest.CloseNewTab3 (8.50s)
Note: Google Test filter = DownloadTest.CloseNewTab3
[==========] Running 1 test from 1 test case.
[----------] Global test environment set-up.
[----------] 1 test from DownloadTest, where TypeParam =
full log
Feb. 23, 2013, 4:06 a.m. http://build.chromium.org/p/chromium.win/json XP Tests (dbg)(4) 29785
[1556:2864:0222/195459:1292078:ERROR:textfield.h(162)] NOT IMPLEMENTED
[1556:928:0222/195500:1292375:FATAL:file_stream_context_win.cc(205)] Check failed: !callback_.is_null(). 
Backtrace:
	base::SparseHistogram::HasConstructionArguments [0x07AF5CE1+2186555]
	base::SparseHistogram::HasConstructionArguments [0x07984E3E+675480]
	net::FtpNetworkTransaction::DoDataConnect [0x09AA3F2D+6750528]
	base::SparseHistogram::HasConstructionArguments [0x07960C9E+527608]
	base::SparseHistogram::HasConstructionArguments [0x0796083F+526489]
	base::SparseHistogram::HasConstructionArguments [0x0795E102+516444]
	base::SparseHistogram::HasConstructionArguments [0x078F659C+91638]
	base::SparseHistogram::HasConstructionArguments [0x0794EEA9+454403]
	base::SparseHistogram::HasConstructionArguments [0x0794EBFE+453720]
	base::SparseHistogram::HasConstructionArguments [0x07923EC9+278307]
	base::SparseHistogram::HasConstructionArguments [0x0794DED1+450347]
	base::SparseHistogram::HasConstructionArguments [0x07AC85F6+2000464]
	TextInputClientMsg_CharacterIndexForPoint::operator= [0x0B7FCA17+6061978]
	TextInputClientMsg_CharacterIndexForPoint::operator= [0x0B7FCC2F+6062514]
	base::SparseHistogram::HasConstructionArguments [0x07AC887E+2001112]
	base::SparseHistogram::HasConstructionArguments [0x07AC4C8F+1985769]
	GetModuleFileNameA [0x7C80B729+442]

[1556:928:0222/195500:1292375:FATAL:file_stream_context_win.cc(205)] Check failed: !callback_.is_null(). 

(trimmed by parser)

	TextInputClientMsg_CharacterIndexForPoint::operator= [0x0B7FCC2F+6062514]
	base::SparseHistogram::HasConstructionArguments [0x07AC887E+2001112]
	base::SparseHistogram::HasConstructionArguments [0x07AC4C8F+1985769]
	GetModuleFileNameA [0x7C80B729+442]

Starting tests...
IMPORTANT DEBUGGING NOTE: each test is run inside its own process.
For debugging a test inside a debugger, use the
--gtest_filter=<your_test_name> flag along with either
--single_process (to run the test in one launcher/browser process) or
--single-process (to do the above, and also run Chrome in single-process mode).
1 test run
1 test failed (0 ignored)
Failing tests:
MetricsServiceTest.CrashRenderers

[277/583] 811.38s BrowsingDataLocalStorageHelperTest.CannedUnique (5.47s)
[278/583] 811.50s PPAPITest.FileIO_Open (10.00s)
[279/584] 811.99s DownloadTest.CloseNewTab3 (6.19s)
Note: Google Test filter = DownloadTest.CloseNewTab3
[==========] Running 1 test from 1 test case.
[----------] Global test environment set-up.
[----------] 1 test from DownloadTest, where TypeParam =
full log
Feb. 23, 2013, 3:32 a.m. http://build.chromium.org/p/chromium.win/json XP Tests (dbg)(4) 29784
[2084:3516:0222/192128:2075750:ERROR:textfield.h(162)] NOT IMPLEMENTED
[2084:2956:0222/192131:2078921:FATAL:file_stream_context_win.cc(205)] Check failed: !callback_.is_null(). 
Backtrace:
	base::SparseHistogram::HasConstructionArguments [0x07AF5CE1+2186555]
	base::SparseHistogram::HasConstructionArguments [0x07984E3E+675480]
	net::FtpNetworkTransaction::DoDataConnect [0x09AA3F2D+6750528]
	base::SparseHistogram::HasConstructionArguments [0x07960C9E+527608]
	base::SparseHistogram::HasConstructionArguments [0x0796083F+526489]
	base::SparseHistogram::HasConstructionArguments [0x0795E102+516444]
	base::SparseHistogram::HasConstructionArguments [0x078F659C+91638]
	base::SparseHistogram::HasConstructionArguments [0x0794EEA9+454403]
	base::SparseHistogram::HasConstructionArguments [0x0794EBFE+453720]
	base::SparseHistogram::HasConstructionArguments [0x07923EC9+278307]
	base::SparseHistogram::HasConstructionArguments [0x0794DED1+450347]
	base::SparseHistogram::HasConstructionArguments [0x07AC85F6+2000464]
	TextInputClientMsg_CharacterIndexForPoint::operator= [0x0B7FCA17+6061978]
	TextInputClientMsg_CharacterIndexForPoint::operator= [0x0B7FCC2F+6062514]
	base::SparseHistogram::HasConstructionArguments [0x07AC887E+2001112]
	base::SparseHistogram::HasConstructionArguments [0x07AC4C8F+1985769]
	GetModuleFileNameA [0x7C80B729+442]

[2084:2956:0222/192131:2078921:FATAL:file_stream_context_win.cc(205)] Check failed: !callback_.is_null(). 

(trimmed by parser)

	TextInputClientMsg_CharacterIndexForPoint::operator= [0x0B7FCC2F+6062514]
	base::SparseHistogram::HasConstructionArguments [0x07AC887E+2001112]
	base::SparseHistogram::HasConstructionArguments [0x07AC4C8F+1985769]
	GetModuleFileNameA [0x7C80B729+442]

Starting tests...
IMPORTANT DEBUGGING NOTE: each test is run inside its own process.
For debugging a test inside a debugger, use the
--gtest_filter=<your_test_name> flag along with either
--single_process (to run the test in one launcher/browser process) or
--single-process (to do the above, and also run Chrome in single-process mode).
1 test run
1 test failed (0 ignored)
Failing tests:
MetricsServiceTest.CrashRenderers

[283/600] 832.32s PPAPITest.FileIO_Open (16.72s)
[284/600] 836.92s BrowsingDataLocalStorageHelperTest.CannedUnique (8.35s)
[285/601] 837.02s DownloadTest.CloseNewTab3 (11.22s)
Note: Google Test filter = DownloadTest.CloseNewTab3
[==========] Running 1 test from 1 test case.
[----------] Global test environment set-up.
[----------] 1 test from DownloadTest, where TypeParam =
full log
Feb. 20, 2013, 7:11 p.m. http://build.chromium.org/p/chromium.win/json Win7 Tests (dbg)(4) 16059

    
    full log
    
  
Feb. 16, 2013, 12:28 a.m. http://build.chromium.org/p/chromium.win/json Win7 Tests (dbg)(4) 15936

    
    full log
    
  
Feb. 14, 2013, 7:50 a.m. http://build.chromium.org/p/chromium.win/json Win7 Tests (dbg)(4) 15873

    
    full log
    
  
Feb. 14, 2013, 6:03 a.m. http://build.chromium.org/p/chromium.win/json Win7 Tests (dbg)(4) 15870

    
    full log
    
  
Feb. 13, 2013, 4:50 a.m. http://build.chromium.org/p/chromium.win/json Win7 Tests (dbg)(4) 15831

    
    full log
    
  
Feb. 4, 2013, 9:29 a.m. http://build.chromium.org/p/chromium.mac/json Mac10.7 Tests (2) 8647
[3102:1287:0204/012637:739085155256:ERROR:master_preferences.cc(110)] Failed to read master_preferences file at /Library (truncated by parser)
[3102:1287:0204/012637:739085258789:WARNING:master_preferences.cc(61)] Failed to parse master prefs file: Line: 1, colum (truncated by parser)
[0204/012707:ERROR:test_launcher.cc(364)] Test timeout (30000 ms) exceeded for MetricsServiceTest.CrashRenderers
BrowserTestBase signal handler received SIGTERM. Backtrace:
0   browser_tests                       0x011e5aca browser_tests + 18545354
1   browser_tests                       0x03e5e328 browser_tests + 65176360
2   libsystem_c.dylib                   0x90fcd59b _sigtramp + 43
3   ???                                 0xffffffff 0x0 + 4294967295
4   browser_tests                       0x0121abc2 browser_tests + 18762690
5   browser_tests                       0x01208cef browser_tests + 18689263
6   browser_tests                       0x03ea2f24 browser_tests + 65457956
7   browser_tests                       0x004eb365 browser_tests + 4936549
8   browser_tests                       0x011bd3e6 browser_tests + 18379750
9   browser_tests                       0x03e5e4e1 browser_tests + 65176801
10  browser_tests                       0x00b843b0 browser_tests + 11854768
11  browser_tests                       0x00b828f3 browser_tests + 11847923
12  browser_tests                       0x03581e9a browser_tests + 55885466
13  browser_tests                       0x0358306d browser_tests + 55890029
14  browser_tests                       0x0358113d browser_tests + 55882045
15  browser_tests                       0x03e5e1f4 browser_tests + 65176052
16  browser_tests                       0x011bc1b4 browser_tests + 18375092
17  browser_tests                       0x015f3492 browser_tests + 22795410
18  browser_tests                       0x015ead70 browser_tests + 22760816
19  browser_tests                       0x015eb9d4 browser_tests + 22763988
20  browser_tests                       0x015ebdeb browser_tests + 22765035
21  browser_tests                       0x015f133b browser_tests + 22786875
22  browser_tests                       0x015f3ba2 browser_tests + 22797218
23  browser_tests                       0x015f0f5f browser_tests + 22785887
24  browser_tests                       0x01251fbc browser_tests + 18988988
25  browser_tests                       0x009d21ab browser_tests + 10076587
26  browser_tests                       0x03e9e648 browser_tests + 65439304
27  browser_tests                       0x009d2115 browser_tests + 10076437
28  browser_tests                       0x000379e5 browser_tests + 6629
29  ???                                 0x00000009 0x0 + 9
Note: Google Test filter = PopupBlockerBrowserTest.UnblockedPopupShowsInHistoryAndOmnibox
[==========] Running 1 test from 1 test case.
[----------] Global test environment set-up.
[----------] 1 test from PopupBlockerBrowserTest, where TypeParam =
full log
Feb. 3, 2013, 10:28 a.m. http://build.chromium.org/p/chromium.mac/json Mac 10.6 Tests (dbg)(4) 23169
[4091:263:0203/022610:2831686276089:ERROR:master_preferences.cc(110)] Failed to read master_preferences file at /Library (truncated by parser)
[4091:263:0203/022610:2831686438275:WARNING:master_preferences.cc(61)] Failed to parse master prefs file: Line: 1, colum (truncated by parser)
[0203/022655:ERROR:test_launcher.cc(364)] Test timeout (45000 ms) exceeded for MetricsServiceTest.CrashRenderers
BrowserTestBase signal handler received SIGTERM. Backtrace:
0   libbase.dylib                       0x7fc5326f base::debug::StackTrace::StackTrace() + 63
1   libbase.dylib                       0x7fc5320b base::debug::StackTrace::StackTrace() + 43
2   browser_tests                       0x75435b6f (anonymous namespace)::DumpStackTraceSignalHandler(int) + 111
3   libSystem.B.dylib                   0x973d105b _sigtramp + 43
4   ???                                 0xffffffff 0x0 + 4294967295
5   libSystem.B.dylib                   0x9738e518 mach_port_insert_member + 133
6   CoreFoundation                      0x94040090 __CFRunLoopRun + 5584
7   CoreFoundation                      0x9403e3c4 CFRunLoopRunSpecific + 452
8   CoreFoundation                      0x9403e1f1 CFRunLoopRunInMode + 97
9   HIToolbox                           0x952afe04 RunCurrentEventLoopInMode + 392
10  HIToolbox                           0x952afbb9 ReceiveNextEventCommon + 354
11  HIToolbox                           0x952afa3e BlockUntilNextEventMatchingListInMode + 81
12  AppKit                              0x980f0595 _DPSNextEvent + 847
13  AppKit                              0x980efdd6 -[NSApplication nextEventMatchingMask:untilDate:inMode:dequeue:] + 15 (truncated by parser)
14  AppKit                              0x980b21f3 -[NSApplication run] + 821
15  libbase.dylib                       0x7fc1b5ce base::MessagePumpNSApplication::DoRun(base::MessagePump::Delegate*) + (truncated by parser)
16  libbase.dylib                       0x7fc1a408 base::MessagePumpCFRunLoopBase::Run(base::MessagePump::Delegate*) + 1 (truncated by parser)
17  libbase.dylib                       0x7fccfea2 MessageLoop::RunInternal() + 290

(trimmed by parser)

34  libcontent.dylib                    0x824dd77b content::BrowserMain(content::MainFunctionParams const&) + 139
35  browser_tests                       0x754359d7 content::BrowserTestBase::SetUp() + 535
36  browser_tests                       0x77474451 InProcessBrowserTest::SetUp() + 1953
37  browser_tests                       0x7542bd81 void testing::internal::HandleSehExceptionsInMethodIfSupported<testin (truncated by parser)
38  browser_tests                       0x7542313e void testing::internal::HandleExceptionsInMethodIfSupported<testing:: (truncated by parser)
39  browser_tests                       0x75418e78 testing::Test::Run() + 152
40  browser_tests                       0x75419337 testing::TestInfo::Run() + 263
41  browser_tests                       0x754198b9 testing::TestCase::Run() + 265
42  browser_tests                       0x7541ec15 testing::internal::UnitTestImpl::RunAllTests() + 821
43  browser_tests                       0x7542a2b1 bool testing::internal::HandleSehExceptionsInMethodIfSupported<testin (truncated by parser)
44  browser_tests                       0x75424f9e bool testing::internal::HandleExceptionsInMethodIfSupported<testing:: (truncated by parser)
45  browser_tests                       0x7541e8a4 testing::UnitTest::Run() + 148
46  browser_tests                       0x774a2ae8 base::TestSuite::Run() + 248
47  browser_tests                       0x743fddf2 ChromeTestLauncherDelegate::RunTestSuite(int, char**) + 82
48  browser_tests                       0x754b8aab content::LaunchTests(content::TestLauncherDelegate*, int, char**) + 1 (truncated by parser)
49  browser_tests                       0x743fdb27 main + 87
50  browser_tests                       0x739a7845 start + 53
[0203/022655:ERROR:process_util_posix.cc(297)] Unable to terminate process group 4091: No such process
objc[4211]: Class MockCrApp is implemented in both /Volumes/data/b/build/slave/Mac_10_6_Tests__dbg__4_/build/src/xcodebu (truncated by parser)
Note: Google Test filter = PrerenderBrowserTest.PrerenderClientRedirectInIframe
[==========] Running 1 test from 1 test case.
[----------] Global test environment set-up.
[----------] 1 test from PrerenderBrowserTest, where TypeParam =
full log
Feb. 2, 2013, 1:48 a.m. http://build.chromium.org/p/chromium.mac/json Mac 10.7 Tests (dbg)(4) 6909
[3371:38147:0201/174651:1089771739100:ERROR:master_preferences.cc(110)] Failed to read master_preferences file at /Libra (truncated by parser)
[3371:38147:0201/174651:1089772095061:WARNING:master_preferences.cc(61)] Failed to parse master prefs file: Line: 1, col (truncated by parser)
[0201/174735:ERROR:test_launcher.cc(364)] Test timeout (45000 ms) exceeded for MetricsServiceTest.CrashRenderers
BrowserTestBase signal handler received SIGTERM. Backtrace:
0   libbase.dylib                       0x0c4632cf base::debug::StackTrace::StackTrace() + 63
1   libbase.dylib                       0x0c46326b base::debug::StackTrace::StackTrace() + 43
2   browser_tests                       0x01c6603f _ZN12_GLOBAL__N_1L27DumpStackTraceSignalHandlerEi + 111
3   libsystem_c.dylib                   0x90fcd59b _sigtramp + 43
4   ???                                 0xffffffff 0x0 + 4294967295
5   libsystem_kernel.dylib              0x9980ea83 mach_port_insert_member + 161
6   CoreFoundation                      0x9c28ad34 __CFRunLoopRun + 1316
7   CoreFoundation                      0x9c28a47c CFRunLoopRunSpecific + 332
8   CoreFoundation                      0x9c28a328 CFRunLoopRunInMode + 120
9   HIToolbox                           0x9013a17f RunCurrentEventLoopInMode + 318
10  HIToolbox                           0x901414e7 ReceiveNextEventCommon + 381
11  HIToolbox                           0x90141356 BlockUntilNextEventMatchingListInMode + 88
12  AppKit                              0x962aba9c _DPSNextEvent + 678
13  AppKit                              0x962ab306 -[NSApplication nextEventMatchingMask:untilDate:inMode:dequeue:] + 11 (truncated by parser)
14  AppKit                              0x962a7675 -[NSApplication run] + 911
15  libbase.dylib                       0x0c42b62e base::MessagePumpNSApplication::DoRun(base::MessagePump::Delegate*) + (truncated by parser)
16  libbase.dylib                       0x0c42a468 base::MessagePumpCFRunLoopBase::Run(base::MessagePump::Delegate*) + 1 (truncated by parser)
17  libbase.dylib                       0x0c4dff02 MessageLoop::RunInternal() + 290

(trimmed by parser)

34  libcontent.dylib                    0x0ececddb content::BrowserMain(content::MainFunctionParams const&) + 139
35  browser_tests                       0x01c65ea7 content::BrowserTestBase::SetUp() + 535
36  browser_tests                       0x03ca4791 InProcessBrowserTest::SetUp() + 1953
37  browser_tests                       0x01c5c251 void testing::internal::HandleSehExceptionsInMethodIfSupported<testin (truncated by parser)
38  browser_tests                       0x01c5360e void testing::internal::HandleExceptionsInMethodIfSupported<testing:: (truncated by parser)
39  browser_tests                       0x01c49348 testing::Test::Run() + 152
40  browser_tests                       0x01c49807 testing::TestInfo::Run() + 263
41  browser_tests                       0x01c49d89 testing::TestCase::Run() + 265
42  browser_tests                       0x01c4f0e5 testing::internal::UnitTestImpl::RunAllTests() + 821
43  browser_tests                       0x01c5a781 bool testing::internal::HandleSehExceptionsInMethodIfSupported<testin (truncated by parser)
44  browser_tests                       0x01c5546e bool testing::internal::HandleExceptionsInMethodIfSupported<testing:: (truncated by parser)
45  browser_tests                       0x01c4ed74 testing::UnitTest::Run() + 148
46  browser_tests                       0x03cd2d98 base::TestSuite::Run() + 248
47  browser_tests                       0x00c2dcd2 ChromeTestLauncherDelegate::RunTestSuite(int, char**) + 82
48  browser_tests                       0x01ce8f7b content::LaunchTests(content::TestLauncherDelegate*, int, char**) + 1 (truncated by parser)
49  browser_tests                       0x00c2da07 main + 87
50  browser_tests                       0x001d7995 start + 53
[0201/174736:ERROR:process_util_posix.cc(297)] Unable to terminate process group 3371: No such process
objc[3496]: Class MockCrApp is implemented in both /Volumes/data/b/build/slave/Mac_10_7_Tests__dbg__4_/build/src/xcodebu (truncated by parser)
Note: Google Test filter = PrerenderBrowserTest.PrerenderClientRedirectInIframe
[==========] Running 1 test from 1 test case.
[----------] Global test environment set-up.
[----------] 1 test from PrerenderBrowserTest, where TypeParam =
full log
Feb. 1, 2013, 5:17 p.m. http://build.chromium.org/p/chromium.mac/json Mac10.7 Tests (2) 8545
[2847:1287:0201/091355:1206414969009:ERROR:master_preferences.cc(110)] Failed to read master_preferences file at /Librar (truncated by parser)
[2847:1287:0201/091355:1206415051430:WARNING:master_preferences.cc(61)] Failed to parse master prefs file: Line: 1, colu (truncated by parser)
[0201/091425:ERROR:test_launcher.cc(364)] Test timeout (30000 ms) exceeded for MetricsServiceTest.CrashRenderers
BrowserTestBase signal handler received SIGTERM. Backtrace:
0   browser_tests                       0x01c79dda browser_tests + 29244890
1   browser_tests                       0x02a78f38 browser_tests + 43921208
2   libsystem_c.dylib                   0x90fcd59b _sigtramp + 43
3   ???                                 0xffffffff 0x0 + 4294967295
4   AppKit                              0x96314b38 -[NSEvent isEqual:] + 82
5   AppKit                              0x96314a9f -[NSApplication _setCurrentEvent:] + 46
6   AppKit                              0x962ab6db -[NSApplication nextEventMatchingMask:untilDate:inMode:dequeue:] + 10 (truncated by parser)
7   AppKit                              0x962a7675 -[NSApplication run] + 911
8   browser_tests                       0x01c65137 browser_tests + 29159735
9   browser_tests                       0x01c64b8c browser_tests + 29158284
10  browser_tests                       0x01ca6301 browser_tests + 29426433
11  browser_tests                       0x01ccb45e browser_tests + 29578334
12  browser_tests                       0x02b06d1d browser_tests + 44502301
13  browser_tests                       0x02b06dcf browser_tests + 44502479
14  browser_tests                       0x0087dd35 browser_tests + 8289589
15  browser_tests                       0x01c3eb96 browser_tests + 29002646
16  browser_tests                       0x02a790f1 browser_tests + 43921649
17  browser_tests                       0x00f6dcd6 browser_tests + 15563990
18  browser_tests                       0x00f6c4f3 browser_tests + 15557875
19  browser_tests                       0x017763ea browser_tests + 23987178
20  browser_tests                       0x01778e3d browser_tests + 23998013
21  browser_tests                       0x0177568d browser_tests + 23983757
22  browser_tests                       0x02a78e04 browser_tests + 43920900
23  browser_tests                       0x01c3d964 browser_tests + 28997988
24  browser_tests                       0x0239f0d2 browser_tests + 36737234
25  browser_tests                       0x023976e0 browser_tests + 36706016
26  browser_tests                       0x02397ca4 browser_tests + 36707492
27  browser_tests                       0x023980bb browser_tests + 36708539
28  browser_tests                       0x0239d54b browser_tests + 36730187
29  browser_tests                       0x0239f642 browser_tests + 36738626
30  browser_tests                       0x0239d16f browser_tests + 36729199
31  browser_tests                       0x01d2c08c browser_tests + 29974668
32  browser_tests                       0x00d96a6b browser_tests + 13634155
33  browser_tests                       0x02adb9b8 browser_tests + 44325304
34  browser_tests                       0x00d969d5 browser_tests + 13634005
35  browser_tests                       0x000fd965 browser_tests + 424293
36  ???                                 0x00000009 0x0 + 9
Note: Google Test filter = PopupBlockerBrowserTest.UnblockedPopupShowsInHistoryAndOmnibox
[==========] Running 1 test from 1 test case.
[----------] Global test environment set-up.
[----------] 1 test from PopupBlockerBrowserTest, where TypeParam =
full log
Feb. 1, 2013, 6:36 a.m. http://build.chromium.org/p/chromium.mac/json Mac10.7 Tests (2) 8522
[2869:1287:0131/223335:989641477104:ERROR:master_preferences.cc(110)] Failed to read master_preferences file at /Library (truncated by parser)
[2869:1287:0131/223335:989641593880:WARNING:master_preferences.cc(61)] Failed to parse master prefs file: Line: 1, colum (truncated by parser)
[0131/223405:ERROR:test_launcher.cc(364)] Test timeout (30000 ms) exceeded for MetricsServiceTest.CrashRenderers
BrowserTestBase signal handler received SIGTERM. Backtrace:
0   browser_tests                       0x01c282fa browser_tests + 29037306
1   browser_tests                       0x02aac6d8 browser_tests + 44259032
2   libsystem_c.dylib                   0x90fcd59b _sigtramp + 43
3   ???                                 0xffffffff 0x0 + 4294967295
4   CoreFoundation                      0x9c260c90 __CFSetStandardHashKey + 32
5   CoreFoundation                      0x9c2513cf CFBasicHashFindBucket + 1679
6   CoreFoundation                      0x9c27b497 CFSetGetValue + 135
7   CoreFoundation                      0x9c28a5f7 __CFRunLoopFindMode + 183
8   CoreFoundation                      0x9c2c77a8 CFRunLoopRemoveObserver + 248
9   AppKit                              0x962ada93 __-[NSApplication setWindowsNeedUpdate:]_block_invoke_2 + 144
10  CoreFoundation                      0x9c2ebf8d _runLoopObserverWithBlockContext + 29
11  CoreFoundation                      0x9c2b847e __CFRUNLOOP_IS_CALLING_OUT_TO_AN_OBSERVER_CALLBACK_FUNCTION__ + 30
12  CoreFoundation                      0x9c2b83bd __CFRunLoopDoObservers + 413
13  CoreFoundation                      0x9c28ac24 __CFRunLoopRun + 1044
14  CoreFoundation                      0x9c28a47c CFRunLoopRunSpecific + 332
15  CoreFoundation                      0x9c28a328 CFRunLoopRunInMode + 120
16  HIToolbox                           0x9013a17f RunCurrentEventLoopInMode + 318
17  HIToolbox                           0x90141412 ReceiveNextEventCommon + 168

(trimmed by parser)

31  browser_tests                       0x00f4bcc6 browser_tests + 15551686
32  browser_tests                       0x00f4a4e3 browser_tests + 15545571
33  browser_tests                       0x0178d94a browser_tests + 24209738
34  browser_tests                       0x0179721d browser_tests + 24248861
35  browser_tests                       0x0178cbed browser_tests + 24206317
36  browser_tests                       0x02aac5a4 browser_tests + 44258724
37  browser_tests                       0x01bdd9b4 browser_tests + 28731828
38  browser_tests                       0x02354452 browser_tests + 36557906
39  browser_tests                       0x0234ca60 browser_tests + 36526688
40  browser_tests                       0x0234d024 browser_tests + 36528164
41  browser_tests                       0x0234d43b browser_tests + 36529211
42  browser_tests                       0x023528cb browser_tests + 36550859
43  browser_tests                       0x023549c2 browser_tests + 36559298
44  browser_tests                       0x023524ef browser_tests + 36549871
45  browser_tests                       0x01cd861c browser_tests + 29759004
46  browser_tests                       0x00d740bb browser_tests + 13619387
47  browser_tests                       0x02b24918 browser_tests + 44751128
48  browser_tests                       0x00d74025 browser_tests + 13619237
49  browser_tests                       0x000ddfa5 browser_tests + 421797
Note: Google Test filter = PopupBlockerBrowserTest.UnblockedPopupShowsInHistoryAndOmnibox
[==========] Running 1 test from 1 test case.
[----------] Global test environment set-up.
[----------] 1 test from PopupBlockerBrowserTest, where TypeParam =
full log
Feb. 1, 2013, 5:15 a.m. http://build.chromium.org/p/chromium.mac/json Mac10.6 Tests (2) 32203
[3496:263:0131/211247:1754644875501:ERROR:master_preferences.cc(110)] Failed to read master_preferences file at /Library (truncated by parser)
[3496:263:0131/211247:1754644974618:WARNING:master_preferences.cc(61)] Failed to parse master prefs file: Line: 1, colum (truncated by parser)
[0131/211317:ERROR:test_launcher.cc(364)] Test timeout (30000 ms) exceeded for MetricsServiceTest.CrashRenderers
BrowserTestBase signal handler received SIGTERM. Backtrace:
0   browser_tests                       0x5500d2fa 0x0 + 1426117370
1   browser_tests                       0x55e91638 0x0 + 1441338936
2   libSystem.B.dylib                   0x9570705b _sigtramp + 43
3   ???                                 0xffffffff 0x0 + 4294967295
4   CoreFoundation                      0x99818aa5 CFRunLoopWakeUp + 133
5   HIToolbox                           0x9395a28a PostEventToQueueInternal + 776
6   AppKit                              0x915b774f -[NSEvent _postAtStart:] + 170
7   browser_tests                       0x54ff1ace 0x0 + 1426004686
8   browser_tests                       0x55059aa2 0x0 + 1426430626
9   browser_tests                       0x54ff118d 0x0 + 1426002317
10  CoreFoundation                      0x99834dd2 __CFRunLoopDoObservers + 1186
11  CoreFoundation                      0x997f0f42 __CFRunLoopRun + 1154
12  CoreFoundation                      0x997f03c4 CFRunLoopRunSpecific + 452
13  CoreFoundation                      0x997f01f1 CFRunLoopRunInMode + 97
14  HIToolbox                           0x9397fe04 RunCurrentEventLoopInMode + 392
15  HIToolbox                           0x9397fbb9 ReceiveNextEventCommon + 354
16  HIToolbox                           0x9397fa3e BlockUntilNextEventMatchingListInMode + 81
17  AppKit                              0x9144c595 _DPSNextEvent + 847

(trimmed by parser)

30  browser_tests                       0x5432f783 0x0 + 1412626307
31  browser_tests                       0x54b72ada 0x0 + 1421290202
32  browser_tests                       0x54b7c3ad 0x0 + 1421329325
33  browser_tests                       0x54b71d7d 0x0 + 1421286781
34  browser_tests                       0x55e91504 0x0 + 1441338628
35  browser_tests                       0x54fc29b4 0x0 + 1425811892
36  browser_tests                       0x55739472 0x0 + 1433638002
37  browser_tests                       0x55731a80 0x0 + 1433606784
38  browser_tests                       0x55732044 0x0 + 1433608260
39  browser_tests                       0x5573245b 0x0 + 1433609307
40  browser_tests                       0x557378eb 0x0 + 1433630955
41  browser_tests                       0x557399e2 0x0 + 1433639394
42  browser_tests                       0x5573750f 0x0 + 1433629967
43  browser_tests                       0x550bd61c 0x0 + 1426839068
44  browser_tests                       0x5415aa5b 0x0 + 1410706011
45  browser_tests                       0x55f09878 0x0 + 1441831032
46  browser_tests                       0x5415a9c5 0x0 + 1410705861
47  browser_tests                       0x534c32f5 0x0 + 1397502709
48  ???                                 0x00000009 0x0 + 9
Note: Google Test filter = PopupBlockerBrowserTest.UnblockedPopupShowsInHistoryAndOmnibox
[==========] Running 1 test from 1 test case.
[----------] Global test environment set-up.
[----------] 1 test from PopupBlockerBrowserTest, where TypeParam =
full log
Jan. 31, 2013, 10:41 p.m. http://build.chromium.org/p/chromium.mac/json Mac 10.7 Tests (dbg)(4) 6848
[3358:37379:0131/143950:1095691583088:ERROR:master_preferences.cc(110)] Failed to read master_preferences file at /Libra (truncated by parser)
[3358:37379:0131/143950:1095691691484:WARNING:master_preferences.cc(61)] Failed to parse master prefs file: Line: 1, col (truncated by parser)
[0131/144034:ERROR:test_launcher.cc(364)] Test timeout (45000 ms) exceeded for MetricsServiceTest.CrashRenderers
BrowserTestBase signal handler received SIGTERM. Backtrace:
0   libbase.dylib                       0x0cb012cf base::debug::StackTrace::StackTrace() + 63
1   libbase.dylib                       0x0cb0126b base::debug::StackTrace::StackTrace() + 43
2   browser_tests                       0x01cb2a1f _ZN12_GLOBAL__N_1L27DumpStackTraceSignalHandlerEi + 111
3   libsystem_c.dylib                   0x90fcd59b _sigtramp + 43
4   ???                                 0xffffffff 0x0 + 4294967295
5   AppKit                              0x96313832 -[NSApplication windowWithWindowNumber:] + 40
6   AppKit                              0x963174dd -[NSEvent window] + 61
7   AppKit                              0x9631aed8 -[NSEvent _cgsEventRecord] + 240
8   AppKit                              0x963abde6 -[NSEvent _eventRefInternal] + 57
9   AppKit                              0x9645ad1b -[NSEvent _postAtStart:] + 258
10  AppKit                              0x9645ac12 -[NSApplication postEvent:atStart:] + 41
11  libbase.dylib                       0x0cac9c8e base::MessagePumpNSApplication::Quit() + 366
12  libbase.dylib                       0x0cb7f1c0 MessageLoop::DoIdleWork() + 112
13  libbase.dylib                       0x0cac8c44 base::MessagePumpCFRunLoopBase::RunIdleWork() + 100
14  libbase.dylib                       0x0cac837f base::MessagePumpCFRunLoopBase::PreWaitObserver(__CFRunLoopObserver*, (truncated by parser)
15  CoreFoundation                      0x9c2b847e __CFRUNLOOP_IS_CALLING_OUT_TO_AN_OBSERVER_CALLBACK_FUNCTION__ + 30
16  CoreFoundation                      0x9c2b83bd __CFRunLoopDoObservers + 413
17  CoreFoundation                      0x9c28acfd __CFRunLoopRun + 1261

(trimmed by parser)

45  libcontent.dylib                    0x0f3655db content::BrowserMain(content::MainFunctionParams const&) + 139
46  browser_tests                       0x01cb2887 content::BrowserTestBase::SetUp() + 535
47  browser_tests                       0x03e5e361 InProcessBrowserTest::SetUp() + 1953
48  browser_tests                       0x01ca8c31 void testing::internal::HandleSehExceptionsInMethodIfSupported<testin (truncated by parser)
49  browser_tests                       0x01c9ffee void testing::internal::HandleExceptionsInMethodIfSupported<testing:: (truncated by parser)
50  browser_tests                       0x01c95d28 testing::Test::Run() + 152
51  browser_tests                       0x01c961e7 testing::TestInfo::Run() + 263
52  browser_tests                       0x01c96769 testing::TestCase::Run() + 265
53  browser_tests                       0x01c9bac5 testing::internal::UnitTestImpl::RunAllTests() + 821
54  browser_tests                       0x01ca7161 bool testing::internal::HandleSehExceptionsInMethodIfSupported<testin (truncated by parser)
55  browser_tests                       0x01ca1e4e bool testing::internal::HandleExceptionsInMethodIfSupported<testing:: (truncated by parser)
56  browser_tests                       0x01c9b754 testing::UnitTest::Run() + 148
57  browser_tests                       0x03e8c968 base::TestSuite::Run() + 248
58  browser_tests                       0x00c72182 ChromeTestLauncherDelegate::RunTestSuite(int, char**) + 82
59  browser_tests                       0x01d34dbb content::LaunchTests(content::TestLauncherDelegate*, int, char**) + 1 (truncated by parser)
60  browser_tests                       0x00c71eb7 main + 87
61  browser_tests                       0x0021d2b5 start + 53
[0131/144035:ERROR:process_util_posix.cc(297)] Unable to terminate process group 3358: No such process
objc[3491]: Class MockCrApp is implemented in both /Volumes/data/b/build/slave/Mac_10_7_Tests__dbg__4_/build/src/xcodebu (truncated by parser)
Note: Google Test filter = PrerenderBrowserTest.PrerenderClientRedirectInIframe
[==========] Running 1 test from 1 test case.
[----------] Global test environment set-up.
[----------] 1 test from PrerenderBrowserTest, where TypeParam =
full log
Jan. 31, 2013, 8:53 p.m. http://build.chromium.org/p/chromium.mac/json Mac 10.7 Tests (dbg)(4) 6843
[3320:37379:0131/125046:1114061784283:ERROR:master_preferences.cc(110)] Failed to read master_preferences file at /Libra (truncated by parser)
[3320:37379:0131/125046:1114061925839:WARNING:master_preferences.cc(61)] Failed to parse master prefs file: Line: 1, col (truncated by parser)
[0131/125131:ERROR:test_launcher.cc(364)] Test timeout (45000 ms) exceeded for MetricsServiceTest.CrashRenderers
BrowserTestBase signal handler received SIGTERM. Backtrace:
0   libbase.dylib                       0x0cac32cf base::debug::StackTrace::StackTrace() + 63
1   libbase.dylib                       0x0cac326b base::debug::StackTrace::StackTrace() + 43
2   browser_tests                       0x01c6491f _ZN12_GLOBAL__N_1L27DumpStackTraceSignalHandlerEi + 111
3   libsystem_c.dylib                   0x90fcd59b _sigtramp + 43
4   ???                                 0xffffffff 0x0 + 4294967295
5   libsystem_c.dylib                   0x90fcad89 free + 232
6   libstdc++.6.dylib                   0x9c459f43 std::string::_Rep::_M_dispose(std::allocator<char> const&) + 67
7   libstdc++.6.dylib                   0x9c459f7d std::basic_string<char, std::char_traits<char>, std::allocator<char>  (truncated by parser)
8   libbase.dylib                       0x0cc54741 base::DictionaryValue::Get(std::string const&, base::Value const**) c (truncated by parser)
9   libbase.dylib                       0x0cc54a87 base::DictionaryValue::Get(std::string const&, base::Value**) + 71
10  libbase_prefs.dylib                 0x0f24bb6c JsonPrefStore::GetValue(std::string const&, base::Value const**) cons (truncated by parser)
11  browser_tests                       0x030c1ace PrefValueStore::GetValueFromStore(char const*, PrefValueStore::PrefSt (truncated by parser)
12  browser_tests                       0x030c0ef1 PrefValueStore::GetValueFromStoreWithType(char const*, base::Value::T (truncated by parser)
13  browser_tests                       0x030c0e2e PrefValueStore::GetValue(std::string const&, base::Value::Type, base: (truncated by parser)
14  browser_tests                       0x030ac66f PrefService::GetPreferenceValue(std::string const&) const + 399
15  browser_tests                       0x030ac9d6 PrefService::GetInteger(char const*) const + 358
16  browser_tests                       0x00710933 MetricsServiceTest_CrashRenderers_Test::RunTestOnMainThread() + 355
17  browser_tests                       0x03e10718 InProcessBrowserTest::RunTestOnMainThreadLoop() + 216

(trimmed by parser)

27  libcontent.dylib                    0x0f34ce0b content::BrowserMain(content::MainFunctionParams const&) + 139
28  browser_tests                       0x01c64787 content::BrowserTestBase::SetUp() + 535
29  browser_tests                       0x03e0f511 InProcessBrowserTest::SetUp() + 1953
30  browser_tests                       0x01c5ab31 void testing::internal::HandleSehExceptionsInMethodIfSupported<testin (truncated by parser)
31  browser_tests                       0x01c51eee void testing::internal::HandleExceptionsInMethodIfSupported<testing:: (truncated by parser)
32  browser_tests                       0x01c47c28 testing::Test::Run() + 152
33  browser_tests                       0x01c480e7 testing::TestInfo::Run() + 263
34  browser_tests                       0x01c48669 testing::TestCase::Run() + 265
35  browser_tests                       0x01c4d9c5 testing::internal::UnitTestImpl::RunAllTests() + 821
36  browser_tests                       0x01c59061 bool testing::internal::HandleSehExceptionsInMethodIfSupported<testin (truncated by parser)
37  browser_tests                       0x01c53d4e bool testing::internal::HandleExceptionsInMethodIfSupported<testing:: (truncated by parser)
38  browser_tests                       0x01c4d654 testing::UnitTest::Run() + 148
39  browser_tests                       0x03e3db18 base::TestSuite::Run() + 248
40  browser_tests                       0x00c264b2 ChromeTestLauncherDelegate::RunTestSuite(int, char**) + 82
41  browser_tests                       0x01ce6cbb content::LaunchTests(content::TestLauncherDelegate*, int, char**) + 1 (truncated by parser)
42  browser_tests                       0x00c261e7 main + 87
43  browser_tests                       0x001d15e5 start + 53
[0131/125131:ERROR:process_util_posix.cc(297)] Unable to terminate process group 3320: No such process
objc[3435]: Class MockCrApp is implemented in both /Volumes/data/b/build/slave/Mac_10_7_Tests__dbg__4_/build/src/xcodebu (truncated by parser)
Note: Google Test filter = PrerenderBrowserTest.PrerenderClientRedirectInIframe
[==========] Running 1 test from 1 test case.
[----------] Global test environment set-up.
[----------] 1 test from PrerenderBrowserTest, where TypeParam =
full log
Jan. 31, 2013, 9:33 a.m. http://build.chromium.org/p/chromium.mac/json Mac10.7 Tests (2) 8456
[2552:1287:0131/013010:483147313677:ERROR:master_preferences.cc(110)] Failed to read master_preferences file at /Library (truncated by parser)
[2552:1287:0131/013010:483147396212:WARNING:master_preferences.cc(61)] Failed to parse master prefs file: Line: 1, colum (truncated by parser)
[0131/013040:ERROR:test_launcher.cc(364)] Test timeout (30000 ms) exceeded for MetricsServiceTest.CrashRenderers
BrowserTestBase signal handler received SIGTERM. Backtrace:
0   browser_tests                       0x01c1fefa browser_tests + 28925690
1   browser_tests                       0x02a6b2c8 browser_tests + 43913928
2   libsystem_c.dylib                   0x90fcd59b _sigtramp + 43
3   ???                                 0xffffffff 0x0 + 4294967295
4   browser_tests                       0x01c09877 browser_tests + 28833911
5   browser_tests                       0x01c092cc browser_tests + 28832460
6   browser_tests                       0x01c72871 browser_tests + 29263985
7   browser_tests                       0x01c9806e browser_tests + 29417582
8   browser_tests                       0x02af981d browser_tests + 44496925
9   browser_tests                       0x02af98cf browser_tests + 44497103
10  browser_tests                       0x0086ef25 browser_tests + 8277797
11  browser_tests                       0x01bdb526 browser_tests + 28644646
12  browser_tests                       0x02a6b481 browser_tests + 43914369
13  browser_tests                       0x00f58066 browser_tests + 15523942
14  browser_tests                       0x00f56883 browser_tests + 15517827
15  browser_tests                       0x017aac4a browser_tests + 24251466
16  browser_tests                       0x017abf6d browser_tests + 24256365
17  browser_tests                       0x017a9fbd browser_tests + 24248253
18  browser_tests                       0x02a6b194 browser_tests + 43913620
19  browser_tests                       0x01bda2f4 browser_tests + 28639988
20  browser_tests                       0x023bf392 browser_tests + 36918162
21  browser_tests                       0x023b79a0 browser_tests + 36886944
22  browser_tests                       0x023b7f64 browser_tests + 36888420
23  browser_tests                       0x023b837b browser_tests + 36889467
24  browser_tests                       0x023bd80b browser_tests + 36911115
25  browser_tests                       0x023bf902 browser_tests + 36919554
26  browser_tests                       0x023bd42f browser_tests + 36910127
27  browser_tests                       0x01cd38ac browser_tests + 29661356
28  browser_tests                       0x00d813cb browser_tests + 13595595
29  browser_tests                       0x02aef1f8 browser_tests + 44454392
30  browser_tests                       0x00d81335 browser_tests + 13595445
31  browser_tests                       0x000f15d5 browser_tests + 423381
32  ???                                 0x00000009 0x0 + 9
Note: Google Test filter = PopupBlockerBrowserTest.UnblockedPopupShowsInHistoryAndOmnibox
[==========] Running 1 test from 1 test case.
[----------] Global test environment set-up.
[----------] 1 test from PopupBlockerBrowserTest, where TypeParam =
full log
Jan. 29, 2013, 8:08 p.m. http://build.chromium.org/p/chromium.win/json Win7 Tests (dbg)(5) 15239
[1260:1604:0129/120202:1521165:ERROR:textfield.h(159)] NOT IMPLEMENTED
browser\metrics\metrics_service_browsertest.cc(111): error: Value of: prefs->GetInteger(prefs::kStabilityRendererCrashCo (truncated by parser)
  Actual: 3
Expected: 1
full log
Jan. 29, 2013, 7:05 p.m. http://build.chromium.org/p/chromium.win/json Win7 Tests (dbg)(5) 15237
[1080:3216:0129/105831:1417003:ERROR:textfield.h(159)] NOT IMPLEMENTED
[1080:1540:0129/105836:1421699:ERROR:ipc_channel_win.cc(401)] pipe error: 232
browser\metrics\metrics_service_browsertest.cc(111): error: Value of: prefs->GetInteger(prefs::kStabilityRendererCrashCo (truncated by parser)
  Actual: 2
Expected: 1
full log
Jan. 28, 2013, 9:39 p.m. http://build.chromium.org/p/chromium.win/json Win7 Tests (dbg)(5) 15204
[2608:384:0128/131630:654361:ERROR:textfield.h(159)] NOT IMPLEMENTED
browser\metrics\metrics_service_browsertest.cc(111): error: Value of: prefs->GetInteger(prefs::kStabilityRendererCrashCo (truncated by parser)
  Actual: 3
Expected: 1
full log
Jan. 28, 2013, 7:50 p.m. http://build.chromium.org/p/chromium.mac/json Mac10.7 Tests (2) 8287
[1990:1287:0128/114543:439317471419:ERROR:master_preferences.cc(110)] Failed to read master_preferences file at /Library (truncated by parser)
[1990:1287:0128/114543:439317574733:WARNING:master_preferences.cc(61)] Failed to parse master prefs file: Line: 1, colum (truncated by parser)
[1990:26115:0128/114543:439325550956:WARNING:address_sorter_posix.cc(381)] FromSockAddr failed
[1990:26115:0128/114543:439325601901:WARNING:address_sorter_posix.cc(396)] SIOCGIFAFLAG_IN6 failed 0
[1990:26115:0128/114543:439325628677:WARNING:address_sorter_posix.cc(396)] SIOCGIFAFLAG_IN6 failed 0
[1990:26115:0128/114543:439325641147:WARNING:address_sorter_posix.cc(381)] FromSockAddr failed
[1990:26115:0128/114543:439325652654:WARNING:address_sorter_posix.cc(381)] FromSockAddr failed
[1990:26115:0128/114543:439325662076:WARNING:address_sorter_posix.cc(381)] FromSockAddr failed
[1990:26115:0128/114543:439325675432:WARNING:address_sorter_posix.cc(396)] SIOCGIFAFLAG_IN6 failed 0
[0128/114613:ERROR:test_launcher.cc(364)] Test timeout (30000 ms) exceeded for MetricsServiceTest.CrashRenderers
0   browser_tests                       0x01baf08a browser_tests + 28598410
1   browser_tests                       0x02a41fd1 browser_tests + 43880401
2   libsystem_c.dylib                   0x90fcd59b _sigtramp + 43
3   ???                                 0xffffffff 0x0 + 4294967295
4   libobjc.A.dylib                     0x9b22e33a objc::DenseMap<objc_object*, unsigned long, true, objc::DenseMapInfo< (truncated by parser)
5   libobjc.A.dylib                     0x9b22e306 objc_clear_deallocating + 200
6   libobjc.A.dylib                     0x9b22e229 objc_destructInstance + 77
7   browser_tests                       0x02b0771a browser_tests + 44689178
8   AppKit                              0x9631b377 -[NSEvent dealloc] + 363
9   libobjc.A.dylib                     0x9b22d54e _objc_rootRelease + 47
10  libobjc.A.dylib                     0x9b22ec58 (anonymous namespace)::AutoreleasePoolPage::pop(void*) + 404
11  CoreFoundation                      0x9c2830a5 _CFAutoreleasePoolPop + 53

(trimmed by parser)

23  browser_tests                       0x00f0965b browser_tests + 15337051
24  browser_tests                       0x00f081a3 browser_tests + 15331747
25  browser_tests                       0x0179237a browser_tests + 24286074
26  browser_tests                       0x0179b00d browser_tests + 24322061
27  browser_tests                       0x017916fd browser_tests + 24282877
28  browser_tests                       0x02a41eb4 browser_tests + 43880116
29  browser_tests                       0x01b65334 browser_tests + 28295988
30  browser_tests                       0x0232bb22 browser_tests + 36449058
31  browser_tests                       0x02324130 browser_tests + 36417840
32  browser_tests                       0x023246f4 browser_tests + 36419316
33  browser_tests                       0x02324b0b browser_tests + 36420363
34  browser_tests                       0x02329f9b browser_tests + 36442011
35  browser_tests                       0x0232c092 browser_tests + 36450450
36  browser_tests                       0x02329bbf browser_tests + 36441023
37  browser_tests                       0x01c6bafc browser_tests + 29371132
38  browser_tests                       0x00d4c36b browser_tests + 13513579
39  browser_tests                       0x02abb868 browser_tests + 44378216
40  browser_tests                       0x00d4c2da browser_tests + 13513434
41  browser_tests                       0x000d0555 browser_tests + 423253
Note: Google Test filter = PopupBlockerBrowserTest.UnblockedPopupShowsInHistoryAndOmnibox
[==========] Running 1 test from 1 test case.
[----------] Global test environment set-up.
[----------] 1 test from PopupBlockerBrowserTest, where TypeParam =
full log
Jan. 27, 2013, 8:40 a.m. http://build.chromium.org/p/chromium.mac/json Mac10.7 Tests (2) 8247
[1387:1287:0127/003407:642681744514:ERROR:master_preferences.cc(110)] Failed to read master_preferences file at /Library (truncated by parser)
[1387:1287:0127/003407:642681844359:WARNING:master_preferences.cc(61)] Failed to parse master prefs file: Line: 1, colum (truncated by parser)
[1387:26883:0127/003407:642695742642:WARNING:address_sorter_posix.cc(381)] FromSockAddr failed
[1387:26883:0127/003407:642695782129:WARNING:address_sorter_posix.cc(396)] SIOCGIFAFLAG_IN6 failed 0
[1387:26883:0127/003407:642695808496:WARNING:address_sorter_posix.cc(396)] SIOCGIFAFLAG_IN6 failed 0
[1387:26883:0127/003407:642695820724:WARNING:address_sorter_posix.cc(381)] FromSockAddr failed
[1387:26883:0127/003407:642695830937:WARNING:address_sorter_posix.cc(381)] FromSockAddr failed
[1387:26883:0127/003407:642695840648:WARNING:address_sorter_posix.cc(381)] FromSockAddr failed
[1387:26883:0127/003407:642695853923:WARNING:address_sorter_posix.cc(396)] SIOCGIFAFLAG_IN6 failed 0
[0127/003437:ERROR:test_launcher.cc(364)] Test timeout (30000 ms) exceeded for MetricsServiceTest.CrashRenderers
0   browser_tests                       0x01c3e05a browser_tests + 28631130
1   browser_tests                       0x02ac9551 browser_tests + 43881809
2   libsystem_c.dylib                   0x90fcd59b _sigtramp + 43
3   ???                                 0xffffffff 0x0 + 4294967295
4   HIToolbox                           0x90152795 SetEventPlatformEvent + 45
5   HIToolbox                           0x9015248f CreateEventWithCGEvent + 8907
6   AppKit                              0x963abe1b -[NSEvent _eventRefInternal] + 110
7   AppKit                              0x9645ad1b -[NSEvent _postAtStart:] + 258
8   AppKit                              0x9645ac12 -[NSApplication postEvent:atStart:] + 41
9   browser_tests                       0x01c24c8e browser_tests + 28527758
10  browser_tests                       0x01c6f322 browser_tests + 28832546
11  browser_tests                       0x01c2434d browser_tests + 28525389

(trimmed by parser)

33  browser_tests                       0x00f9a803 browser_tests + 15378435
34  browser_tests                       0x0181710a browser_tests + 24277258
35  browser_tests                       0x0181f29d browser_tests + 24310429
36  browser_tests                       0x0181648d browser_tests + 24274061
37  browser_tests                       0x02ac9434 browser_tests + 43881524
38  browser_tests                       0x01bf45b4 browser_tests + 28329396
39  browser_tests                       0x023b65b2 browser_tests + 36464050
40  browser_tests                       0x023aebc0 browser_tests + 36432832
41  browser_tests                       0x023af184 browser_tests + 36434308
42  browser_tests                       0x023af59b browser_tests + 36435355
43  browser_tests                       0x023b4a2b browser_tests + 36457003
44  browser_tests                       0x023b6b22 browser_tests + 36465442
45  browser_tests                       0x023b464f browser_tests + 36456015
46  browser_tests                       0x01cf5bfc browser_tests + 29383676
47  browser_tests                       0x00de050b browser_tests + 13567243
48  browser_tests                       0x02b40908 browser_tests + 44370184
49  browser_tests                       0x00de0475 browser_tests + 13567093
50  browser_tests                       0x00156e85 browser_tests + 421509
51  ???                                 0x00000009 0x0 + 9
Note: Google Test filter = PopupBlockerBrowserTest.UnblockedPopupShowsInHistoryAndOmnibox
[==========] Running 1 test from 1 test case.
[----------] Global test environment set-up.
[----------] 1 test from PopupBlockerBrowserTest, where TypeParam =
full log
Jan. 25, 2013, 6:22 p.m. http://build.chromium.org/p/chromium.mac/json Mac10.7 Tests (2) 8184
[1357:-1408298304:0125/101636:319733753447:WARNING:master_preferences.cc(61)] Failed to parse master prefs file: Line: 1 (truncated by parser)
[1357:-1408298304:0125/101636:320614568614:WARNING:geolocation_browsertest.cc(238)] before navigate
[1357:-1408298304:0125/101637:320680492036:WARNING:geolocation_browsertest.cc(253)] after navigate
[1357:-1408298304:0125/101637:320734764937:WARNING:geolocation_browsertest.cc(584)] frames loaded
[1357:-1408298304:0125/101637:320735841916:WARNING:geolocation_browsertest.cc(139)] will add geolocation watch
[1357:-1408298304:0125/101637:320743643598:WARNING:geolocation_browsertest.cc(167)] javascript_response 1
[1357:-1408298304:0125/101637:320743904489:WARNING:geolocation_browsertest.cc(147)] got geolocation watch1
[1357:-1408298304:0125/101637:320743934436:WARNING:geolocation_browsertest.cc(300)] will set infobar response
[1357:-1408298304:0125/101637:320754469156:WARNING:geolocation_browsertest.cc(314)] infobar response set
[1357:-1408298304:0125/101637:320758655705:WARNING:geolocation_browsertest.cc(139)] will add geolocation watch
[1357:-1408298304:0125/101637:320759221302:WARNING:geolocation_browsertest.cc(167)] javascript_response 1
[1357:-1408298304:0125/101637:320778267503:WARNING:geolocation_browsertest.cc(147)] got geolocation watch1
[1357:-1408298304:0125/101637:320778324625:WARNING:geolocation_browsertest.cc(300)] will set infobar response
[1357:-1408298304:0125/101637:320792316623:WARNING:geolocation_browsertest.cc(314)] infobar response set
[1357:-1408298304:0125/101637:320851520368:WARNING:pref_notifier_impl.cc(27)] pref observer found at shutdown select_fil (truncated by parser)
[1357:-1408298304:0125/101637:320854731606:WARNING:geolocation_browsertest.cc(220)] TearDownInProcessBrowserTestFixture. (truncated by parser)
[1368:-1408298304:0125/101637:321124727595:ERROR:master_preferences.cc(110)] Failed to read master_preferences file at / (truncated by parser)
[1368:-1408298304:0125/101637:321124826728:WARNING:master_preferences.cc(61)] Failed to parse master prefs file: Line: 1 (truncated by parser)
[1368:-1408298304:0125/101638:322003378786:WARNING:pref_notifier_impl.cc(27)] pref observer found at shutdown select_fil (truncated by parser)
[0125/101707:ERROR:test_launcher.cc(364)] Test timeout (30000 ms) exceeded for MetricsServiceTest.CrashRenderers
0   browser_tests                       0x01b861da browser_tests + 28541402
1   browser_tests                       0x029d22d1 browser_tests + 43533009

(trimmed by parser)

11  browser_tests                       0x00eea033 browser_tests + 15319091
12  browser_tests                       0x01758428 browser_tests + 24159272
13  browser_tests                       0x0175db33 browser_tests + 24181555
14  browser_tests                       0x01756e9b browser_tests + 24153755
15  browser_tests                       0x029d21b4 browser_tests + 43532724
16  browser_tests                       0x01b3df34 browser_tests + 28245812
17  browser_tests                       0x02303da2 browser_tests + 36396450
18  browser_tests                       0x022fc3b0 browser_tests + 36365232
19  browser_tests                       0x022fc974 browser_tests + 36366708
20  browser_tests                       0x022fcd8b browser_tests + 36367755
21  browser_tests                       0x0230221b browser_tests + 36389403
22  browser_tests                       0x02304312 browser_tests + 36397842
23  browser_tests                       0x02301e3f browser_tests + 36388415
24  browser_tests                       0x01c3afbc browser_tests + 29282236
25  browser_tests                       0x00d30dbb browser_tests + 13512123
26  browser_tests                       0x02a57258 browser_tests + 44077656
27  browser_tests                       0x00d30d25 browser_tests + 13511973
28  browser_tests                       0x000b4855 browser_tests + 419925
29  ???                                 0x00000009 0x0 + 9
Note: Google Test filter = PopupBlockerBrowserTest.UnblockedPopupShowsInHistoryAndOmnibox
[==========] Running 1 test from 1 test case.
[----------] Global test environment set-up.
[----------] 1 test from PopupBlockerBrowserTest, where TypeParam =
full log
Jan. 25, 2013, 11:53 a.m. http://build.chromium.org/p/chromium.win/json Win7 Tests (dbg)(5) 15131
[2144:216:0125/033035:627904:ERROR:textfield.h(159)] NOT IMPLEMENTED
browser\metrics\metrics_service_browsertest.cc(110): error: Value of: prefs->GetInteger(prefs::kStabilityPageLoadCount)
  Actual: 5
Expected: 4
full log
Jan. 25, 2013, 11:33 a.m. http://build.chromium.org/p/chromium.win/json XP Tests (dbg)(5) 25424
[3908:1688:0125/030402:1215750:ERROR:textfield.h(159)] NOT IMPLEMENTED
browser\metrics\metrics_service_browsertest.cc(110): error: Value of: prefs->GetInteger(prefs::kStabilityPageLoadCount)
  Actual: 5
Expected: 4
full log
Jan. 25, 2013, 11:31 a.m. http://build.chromium.org/p/chromium.win/json XP Tests (dbg)(5) 25425
[2180:2964:0125/030949:3601625:ERROR:textfield.h(159)] NOT IMPLEMENTED
browser\metrics\metrics_service_browsertest.cc(110): error: Value of: prefs->GetInteger(prefs::kStabilityPageLoadCount)
  Actual: 5
Expected: 4
full log
Jan. 25, 2013, 11:19 a.m. http://build.chromium.org/p/chromium.win/json Win7 Tests (dbg)(5) 15130
[3264:4088:0125/025629:1066282:ERROR:textfield.h(159)] NOT IMPLEMENTED
browser\metrics\metrics_service_browsertest.cc(110): error: Value of: prefs->GetInteger(prefs::kStabilityPageLoadCount)
  Actual: 5
Expected: 4
[3264:320:0125/025631:1067639:ERROR:ipc_channel_win.cc(401)] pipe error: 232
full log
Jan. 25, 2013, 10:41 a.m. http://build.chromium.org/p/chromium.win/json XP Tests (dbg)(5) 25423
[3436:2736:0125/021233:956671:ERROR:textfield.h(159)] NOT IMPLEMENTED
browser\metrics\metrics_service_browsertest.cc(110): error: Value of: prefs->GetInteger(prefs::kStabilityPageLoadCount)
  Actual: 5
Expected: 4
full log
Jan. 25, 2013, 10:38 a.m. http://build.chromium.org/p/chromium.win/json Win7 Tests (dbg)(5) 15129
[2012:1780:0125/021326:678635:ERROR:textfield.h(159)] NOT IMPLEMENTED
browser\metrics\metrics_service_browsertest.cc(110): error: Value of: prefs->GetInteger(prefs::kStabilityPageLoadCount)
  Actual: 5
Expected: 4
full log
Jan. 25, 2013, 10:09 a.m. http://build.chromium.org/p/chromium.win/json XP Tests (dbg)(5) 25422
[3556:2084:0125/014005:2485515:ERROR:textfield.h(159)] NOT IMPLEMENTED
browser\metrics\metrics_service_browsertest.cc(110): error: Value of: prefs->GetInteger(prefs::kStabilityPageLoadCount)
  Actual: 5
Expected: 4
full log
Jan. 25, 2013, 10:01 a.m. http://build.chromium.org/p/chromium.win/json Win7 Tests (dbg)(5) 15128
[4076:2068:0125/013804:730490:ERROR:textfield.h(159)] NOT IMPLEMENTED
browser\metrics\metrics_service_browsertest.cc(110): error: Value of: prefs->GetInteger(prefs::kStabilityPageLoadCount)
  Actual: 5
Expected: 4
full log
Jan. 25, 2013, 5:47 a.m. http://build.chromium.org/p/chromium.mac/json Mac 10.7 Tests (dbg)(4) 6570
[2711:-1408298304:0124/214225:852006026429:ERROR:master_preferences.cc(110)] Failed to read master_preferences file at / (truncated by parser)
[2711:-1408298304:0124/214225:852006145136:WARNING:master_preferences.cc(61)] Failed to parse master prefs file: Line: 1 (truncated by parser)
[0124/214310:ERROR:test_launcher.cc(364)] Test timeout (45000 ms) exceeded for MetricsServiceTest.CrashRenderers
0   libbase.dylib                       0x0c7b5a1f base::debug::StackTrace::StackTrace() + 63
1   libbase.dylib                       0x0c7b59bb base::debug::StackTrace::StackTrace() + 43
2   browser_tests                       0x01bdab32 _ZN12_GLOBAL__N_1L27DumpStackTraceSignalHandlerEi + 66
3   libsystem_c.dylib                   0x90fcd59b _sigtramp + 43
4   ???                                 0xffffffff 0x0 + 4294967295
5   libbase.dylib                       0x0c77cb0f base::MessagePumpCFRunLoopBase::PreSourceObserver(__CFRunLoopObserver (truncated by parser)
6   CoreFoundation                      0x9c2b847e __CFRUNLOOP_IS_CALLING_OUT_TO_AN_OBSERVER_CALLBACK_FUNCTION__ + 30
7   CoreFoundation                      0x9c2b83bd __CFRunLoopDoObservers + 413
8   CoreFoundation                      0x9c28ac43 __CFRunLoopRun + 1075
9   CoreFoundation                      0x9c28a47c CFRunLoopRunSpecific + 332
10  CoreFoundation                      0x9c28a328 CFRunLoopRunInMode + 120
11  HIToolbox                           0x9013a17f RunCurrentEventLoopInMode + 318
12  HIToolbox                           0x901414e7 ReceiveNextEventCommon + 381
13  HIToolbox                           0x90141356 BlockUntilNextEventMatchingListInMode + 88
14  AppKit                              0x962aba9c _DPSNextEvent + 678
15  AppKit                              0x962ab306 -[NSApplication nextEventMatchingMask:untilDate:inMode:dequeue:] + 11 (truncated by parser)
16  AppKit                              0x962a7675 -[NSApplication run] + 911
17  libbase.dylib                       0x0c77e0ee base::MessagePumpNSApplication::DoRun(base::MessagePump::Delegate*) + (truncated by parser)
18  libbase.dylib                       0x0c77cf28 base::MessagePumpCFRunLoopBase::Run(base::MessagePump::Delegate*) + 1 (truncated by parser)

(trimmed by parser)

36  libcontent.dylib                    0x0ef6839b content::BrowserMain(content::MainFunctionParams const&) + 139
37  browser_tests                       0x01bda9c7 content::BrowserTestBase::SetUp() + 535
38  browser_tests                       0x03d46381 InProcessBrowserTest::SetUp() + 1953
39  browser_tests                       0x01bd0d71 void testing::internal::HandleSehExceptionsInMethodIfSupported<testin (truncated by parser)
40  browser_tests                       0x01bc812e void testing::internal::HandleExceptionsInMethodIfSupported<testing:: (truncated by parser)
41  browser_tests                       0x01bbde68 testing::Test::Run() + 152
42  browser_tests                       0x01bbe327 testing::TestInfo::Run() + 263
43  browser_tests                       0x01bbe8a9 testing::TestCase::Run() + 265
44  browser_tests                       0x01bc3c05 testing::internal::UnitTestImpl::RunAllTests() + 821
45  browser_tests                       0x01bcf2a1 bool testing::internal::HandleSehExceptionsInMethodIfSupported<testin (truncated by parser)
46  browser_tests                       0x01bc9f8e bool testing::internal::HandleExceptionsInMethodIfSupported<testing:: (truncated by parser)
47  browser_tests                       0x01bc3894 testing::UnitTest::Run() + 148
48  browser_tests                       0x03d74e38 base::TestSuite::Run() + 248
49  browser_tests                       0x00c15a42 ChromeTestLauncherDelegate::RunTestSuite(int, char**) + 82
50  browser_tests                       0x01c5808b content::LaunchTests(content::TestLauncherDelegate*, int, char**) + 1 (truncated by parser)
51  browser_tests                       0x00c15777 main + 87
52  browser_tests                       0x001d1975 start + 53
[0124/214310:ERROR:process_util_posix.cc(297)] Unable to terminate process group 2711: No such process
objc[2849]: Class MockCrApp is implemented in both /Volumes/data/b/build/slave/Mac_10_7_Tests__dbg__4_/build/src/xcodebu (truncated by parser)
Note: Google Test filter = PrerenderBrowserTest.PrerenderServerRedirectNavigateToFirst
[==========] Running 1 test from 1 test case.
[----------] Global test environment set-up.
[----------] 1 test from PrerenderBrowserTest, where TypeParam =
full log
Jan. 25, 2013, 12:03 a.m. http://build.chromium.org/p/chromium.win/json Vista Tests (2) 31235
[131344:131348:0124/160021:1896234:ERROR:textfield.h(159)] NOT IMPLEMENTED
[0124/160045:ERROR:test_launcher.cc(364)] Test timeout (30000 ms) exceeded for MetricsServiceTest.CrashRenderers
Note: Google Test filter = BrowsingDataLocalStorageHelperTest.CannedAddLocalStorage
[==========] Running 1 test from 1 test case.
[----------] Global test environment set-up.
[----------] 1 test from BrowsingDataLocalStorageHelperTest, where TypeParam =
full log
Jan. 24, 2013, 11:28 p.m. http://build.chromium.org/p/chromium.win/json Vista Tests (2) 31234
[5128:2640:0124/152422:2371765:ERROR:textfield.h(159)] NOT IMPLEMENTED
[0124/152444:ERROR:test_launcher.cc(364)] Test timeout (30000 ms) exceeded for MetricsServiceTest.CrashRenderers
Note: Google Test filter = BrowsingDataLocalStorageHelperTest.CannedAddLocalStorage
[==========] Running 1 test from 1 test case.
[----------] Global test environment set-up.
[----------] 1 test from BrowsingDataLocalStorageHelperTest, where TypeParam =
full log
Jan. 24, 2013, 2:12 p.m. http://build.chromium.org/p/chromium.win/json Vista Tests (2) 31217
[124096:124228:0124/060819:1543796:ERROR:textfield.h(159)] NOT IMPLEMENTED
[0124/060842:ERROR:test_launcher.cc(364)] Test timeout (30000 ms) exceeded for MetricsServiceTest.CrashRenderers
Note: Google Test filter = BrowsingDataLocalStorageHelperTest.CannedAddLocalStorage
[==========] Running 1 test from 1 test case.
[----------] Global test environment set-up.
[----------] 1 test from BrowsingDataLocalStorageHelperTest, where TypeParam =
full log
Jan. 24, 2013, 10:29 a.m. http://build.chromium.org/p/chromium.mac/json Mac 10.7 Tests (dbg)(4) 6530
[2893:-1408298304:0124/022513:4221944446834:ERROR:master_preferences.cc(110)] Failed to read master_preferences file at  (truncated by parser)
[2893:-1408298304:0124/022513:4221944604325:WARNING:master_preferences.cc(61)] Failed to parse master prefs file: Line:  (truncated by parser)
[0124/022558:ERROR:test_launcher.cc(364)] Test timeout (45000 ms) exceeded for MetricsServiceTest.CrashRenderers
0   libbase.dylib                       0x0c7b7caf base::debug::StackTrace::StackTrace() + 63
1   libbase.dylib                       0x0c7b7c4b base::debug::StackTrace::StackTrace() + 43
2   browser_tests                       0x01c0ec42 _ZN12_GLOBAL__N_1L27DumpStackTraceSignalHandlerEi + 66
3   libsystem_c.dylib                   0x90fcd59b _sigtramp + 43
4   ???                                 0xffffffff 0x0 + 4294967295
5   libobjc.A.dylib                     0x9b22d5dc _objc_rootReleaseWasZero + 121
6   libobjc.A.dylib                     0x9b22d538 _objc_rootRelease + 25
7   CoreFoundation                      0x9c2582d9 CFRelease + 169
8   CoreFoundation                      0x9c260ea0 __CFRunLoopDoSources0 + 512
9   CoreFoundation                      0x9c28ac68 __CFRunLoopRun + 1112
10  CoreFoundation                      0x9c28a47c CFRunLoopRunSpecific + 332
11  CoreFoundation                      0x9c28a328 CFRunLoopRunInMode + 120
12  HIToolbox                           0x9013a17f RunCurrentEventLoopInMode + 318
13  HIToolbox                           0x90141412 ReceiveNextEventCommon + 168
14  HIToolbox                           0x90141356 BlockUntilNextEventMatchingListInMode + 88
15  AppKit                              0x962aba9c _DPSNextEvent + 678
16  AppKit                              0x962ab306 -[NSApplication nextEventMatchingMask:untilDate:inMode:dequeue:] + 11 (truncated by parser)
17  AppKit                              0x962a7675 -[NSApplication run] + 911
18  libbase.dylib                       0x0c78037e base::MessagePumpNSApplication::DoRun(base::MessagePump::Delegate*) + (truncated by parser)

(trimmed by parser)

38  browser_tests                       0x01c0ead7 content::BrowserTestBase::SetUp() + 535
39  browser_tests                       0x03d778f1 InProcessBrowserTest::SetUp() + 1953
40  browser_tests                       0x01c04e81 void testing::internal::HandleSehExceptionsInMethodIfSupported<testin (truncated by parser)
41  browser_tests                       0x01bfc23e void testing::internal::HandleExceptionsInMethodIfSupported<testing:: (truncated by parser)
42  browser_tests                       0x01bf1f78 testing::Test::Run() + 152
43  browser_tests                       0x01bf2437 testing::TestInfo::Run() + 263
44  browser_tests                       0x01bf29b9 testing::TestCase::Run() + 265
45  browser_tests                       0x01bf7d15 testing::internal::UnitTestImpl::RunAllTests() + 821
46  browser_tests                       0x01c033b1 bool testing::internal::HandleSehExceptionsInMethodIfSupported<testin (truncated by parser)
47  browser_tests                       0x01bfe09e bool testing::internal::HandleExceptionsInMethodIfSupported<testing:: (truncated by parser)
48  browser_tests                       0x01bf79a4 testing::UnitTest::Run() + 148
49  browser_tests                       0x03da5988 base::TestSuite::Run() + 248
50  browser_tests                       0x00c362e2 ChromeTestLauncherDelegate::RunTestSuite(int, char**) + 82
51  browser_tests                       0x01c8c1eb content::LaunchTests(content::TestLauncherDelegate*, int, char**) + 1 (truncated by parser)
52  browser_tests                       0x00c36017 main + 87
53  browser_tests                       0x001fd925 start + 53
54  ???                                 0x00000009 0x0 + 9
[0124/022558:ERROR:process_util_posix.cc(297)] Unable to terminate process group 2893: No such process
objc[3026]: Class MockCrApp is implemented in both /Volumes/data/b/build/slave/Mac_10_7_Tests__dbg__4_/build/src/xcodebu (truncated by parser)
Note: Google Test filter = PrerenderBrowserTest.PrerenderServerRedirectNavigateToFirst
[==========] Running 1 test from 1 test case.
[----------] Global test environment set-up.
[----------] 1 test from PrerenderBrowserTest, where TypeParam =
full log
Jan. 24, 2013, 2:43 a.m. http://build.chromium.org/p/chromium.win/json Vista Tests (2) 31201
[15984:15960:0123/184027:2137000:ERROR:textfield.h(159)] NOT IMPLEMENTED
[0123/184050:ERROR:test_launcher.cc(364)] Test timeout (30000 ms) exceeded for MetricsServiceTest.CrashRenderers
Note: Google Test filter = BrowsingDataLocalStorageHelperTest.CannedAddLocalStorage
[==========] Running 1 test from 1 test case.
[----------] Global test environment set-up.
[----------] 1 test from BrowsingDataLocalStorageHelperTest, where TypeParam =
full log
Jan. 24, 2013, 12:28 a.m. http://build.chromium.org/p/chromium.win/json Vista Tests (2) 31197
[129980:130092:0123/162535:1805000:ERROR:textfield.h(159)] NOT IMPLEMENTED
[129980:133252:0123/162553:1823562:ERROR:ipc_channel_win.cc(401)] pipe error: 232
[0123/162558:ERROR:test_launcher.cc(364)] Test timeout (30000 ms) exceeded for MetricsServiceTest.CrashRenderers
Note: Google Test filter = BrowsingDataLocalStorageHelperTest.CannedAddLocalStorage
[==========] Running 1 test from 1 test case.
[----------] Global test environment set-up.
[----------] 1 test from BrowsingDataLocalStorageHelperTest, where TypeParam =
full log
Jan. 23, 2013, 4:11 p.m. http://build.chromium.org/p/chromium.mac/json Mac 10.7 Tests (dbg)(4) 6485
[0123/080709:ERROR:test_launcher.cc(364)] Test timeout (45000 ms) exceeded for MetricsServiceTest.CrashRenderers
0   libbase.dylib                       0x0c7ff91f base::debug::StackTrace::StackTrace() + 63
1   libbase.dylib                       0x0c7ff8bb base::debug::StackTrace::StackTrace() + 43
2   browser_tests                       0x01c11a02 _ZN12_GLOBAL__N_1L27DumpStackTraceSignalHandlerEi + 66
3   libsystem_c.dylib                   0x90fcd59b _sigtramp + 43
4   ???                                 0xffffffff 0x0 + 4294967295
5   libbase.dylib                       0x0c97b52e std::_Rb_tree<tracked_objects::Location, std::pair<tracked_objects::L (truncated by parser)
6   libbase.dylib                       0x0c974679 std::map<tracked_objects::Location, tracked_objects::Births*, std::le (truncated by parser)
7   libbase.dylib                       0x0c972024 tracked_objects::ThreadData::TallyABirth(tracked_objects::Location co (truncated by parser)
8   libbase.dylib                       0x0c97231c tracked_objects::ThreadData::TallyABirthIfActive(tracked_objects::Loc (truncated by parser)
9   libbase.dylib                       0x0c9818dd base::TrackingInfo::TrackingInfo(tracked_objects::Location const&, ba (truncated by parser)
10  libbase.dylib                       0x0c8c6cbd base::PendingTask::PendingTask(tracked_objects::Location const&, base (truncated by parser)
11  libbase.dylib                       0x0c8c6c1e base::PendingTask::PendingTask(tracked_objects::Location const&, base (truncated by parser)
12  libbase.dylib                       0x0c87a185 MessageLoop::PostTask(tracked_objects::Location const&, base::Callbac (truncated by parser)
13  browser_tests                       0x01c99777 content::RunAllPendingInMessageLoop() + 135
14  browser_tests                       0x00718211 MetricsServiceTest_CrashRenderers_Test::RunTestOnMainThread() + 385
15  browser_tests                       0x03d7d4f0 InProcessBrowserTest::RunTestOnMainThreadLoop() + 208
16  browser_tests                       0x01c11957 content::BrowserTestBase::ProxyRunTestOnMainThreadLoop() + 119
17  browser_tests                       0x01c12424 base::internal::RunnableAdapter<void (content::BrowserTestBase::*)()> (truncated by parser)
18  browser_tests                       0x01c12323 base::internal::InvokeHelper<false, void, base::internal::RunnableAda (truncated by parser)
19  browser_tests                       0x01c1226c base::internal::Invoker<1, base::internal::BindState<base::internal:: (truncated by parser)
20  browser_tests                       0x002cd6eb base::Callback<void ()()>::Run() const + 75

(trimmed by parser)

25  libcontent.dylib                    0x0ef9b9db content::BrowserMain(content::MainFunctionParams const&) + 139
26  browser_tests                       0x01c11897 content::BrowserTestBase::SetUp() + 535
27  browser_tests                       0x03d7c2f1 InProcessBrowserTest::SetUp() + 1953
28  browser_tests                       0x01c07c41 void testing::internal::HandleSehExceptionsInMethodIfSupported<testin (truncated by parser)
29  browser_tests                       0x01bfeffe void testing::internal::HandleExceptionsInMethodIfSupported<testing:: (truncated by parser)
30  browser_tests                       0x01bf4d38 testing::Test::Run() + 152
31  browser_tests                       0x01bf51f7 testing::TestInfo::Run() + 263
32  browser_tests                       0x01bf5779 testing::TestCase::Run() + 265
33  browser_tests                       0x01bfaad5 testing::internal::UnitTestImpl::RunAllTests() + 821
34  browser_tests                       0x01c06171 bool testing::internal::HandleSehExceptionsInMethodIfSupported<testin (truncated by parser)
35  browser_tests                       0x01c00e5e bool testing::internal::HandleExceptionsInMethodIfSupported<testing:: (truncated by parser)
36  browser_tests                       0x01bfa764 testing::UnitTest::Run() + 148
37  browser_tests                       0x03daa2f8 base::TestSuite::Run() + 248
38  browser_tests                       0x00c39ee2 ChromeTestLauncherDelegate::RunTestSuite(int, char**) + 82
39  browser_tests                       0x01c8ef5b content::LaunchTests(content::TestLauncherDelegate*, int, char**) + 1 (truncated by parser)
40  browser_tests                       0x00c39c17 main + 87
41  browser_tests                       0x00206b75 start + 53
[0123/080709:ERROR:process_util_posix.cc(297)] Unable to terminate process group 2710: No such process
objc[2848]: Class MockCrApp is implemented in both /Volumes/data/b/build/slave/Mac_10_7_Tests__dbg__4_/build/src/xcodebu (truncated by parser)
Note: Google Test filter = PrerenderBrowserTest.PrerenderServerRedirectNavigateToFirst
[==========] Running 1 test from 1 test case.
[----------] Global test environment set-up.
[----------] 1 test from PrerenderBrowserTest, where TypeParam =
full log
Jan. 23, 2013, 12:45 p.m. http://build.chromium.org/p/chromium.win/json Vista Tests (2) 31175
[128816:127028:0123/044137:5177750:ERROR:textfield.h(159)] NOT IMPLEMENTED
[0123/044202:ERROR:test_launcher.cc(364)] Test timeout (30000 ms) exceeded for MetricsServiceTest.CrashRenderers
Note: Google Test filter = BrowsingDataLocalStorageHelperTest.CannedAddLocalStorage
[==========] Running 1 test from 1 test case.
[----------] Global test environment set-up.
[----------] 1 test from BrowsingDataLocalStorageHelperTest, where TypeParam =
full log
Jan. 23, 2013, 9:28 a.m. http://build.chromium.org/p/chromium.win/json Win7 Tests (dbg)(4) 15212
[4300:4584:0123/011950:2051959:ERROR:textfield.h(159)] NOT IMPLEMENTED
browser\metrics\metrics_service_browsertest.cc(111): error: Value of: prefs->GetInteger(prefs::kStabilityRendererCrashCo (truncated by parser)
  Actual: 3
Expected: 1
full log
Jan. 22, 2013, 11:34 p.m. http://build.chromium.org/p/chromium.mac/json Mac 10.7 Tests (dbg)(4) 6446
[0122/152911:ERROR:test_launcher.cc(364)] Test timeout (45000 ms) exceeded for MetricsServiceTest.CrashRenderers
0   libbase.dylib                       0x0c7cd1af base::debug::StackTrace::StackTrace() + 63
1   libbase.dylib                       0x0c7cd14b base::debug::StackTrace::StackTrace() + 43
2   browser_tests                       0x01b60682 _ZN12_GLOBAL__N_1L27DumpStackTraceSignalHandlerEi + 66
3   libsystem_c.dylib                   0x90fcd59b _sigtramp + 43
4   ???                                 0xffffffff 0x0 + 4294967295
5   AppKit                              0x962adb23 -[NSApplication updateWindows] + 117
6   AppKit                              0x962ada4c __-[NSApplication setWindowsNeedUpdate:]_block_invoke_2 + 73
7   CoreFoundation                      0x9c2ebf8d _runLoopObserverWithBlockContext + 29
8   CoreFoundation                      0x9c2b847e __CFRUNLOOP_IS_CALLING_OUT_TO_AN_OBSERVER_CALLBACK_FUNCTION__ + 30
9   CoreFoundation                      0x9c2b83bd __CFRunLoopDoObservers + 413
10  CoreFoundation                      0x9c28ac24 __CFRunLoopRun + 1044
11  CoreFoundation                      0x9c28a47c CFRunLoopRunSpecific + 332
12  CoreFoundation                      0x9c28a328 CFRunLoopRunInMode + 120
13  HIToolbox                           0x9013a17f RunCurrentEventLoopInMode + 318
14  HIToolbox                           0x90141412 ReceiveNextEventCommon + 168
15  HIToolbox                           0x90141356 BlockUntilNextEventMatchingListInMode + 88
16  AppKit                              0x962aba9c _DPSNextEvent + 678
17  AppKit                              0x962ab306 -[NSApplication nextEventMatchingMask:untilDate:inMode:dequeue:] + 11 (truncated by parser)
18  AppKit                              0x962a7675 -[NSApplication run] + 911
19  libbase.dylib                       0x0c7959be base::MessagePumpNSApplication::DoRun(base::MessagePump::Delegate*) + (truncated by parser)
20  libbase.dylib                       0x0c7947f8 base::MessagePumpCFRunLoopBase::Run(base::MessagePump::Delegate*) + 1 (truncated by parser)

(trimmed by parser)

39  browser_tests                       0x01b60517 content::BrowserTestBase::SetUp() + 535
40  browser_tests                       0x03cecfa1 InProcessBrowserTest::SetUp() + 1953
41  browser_tests                       0x01b568c1 void testing::internal::HandleSehExceptionsInMethodIfSupported<testin (truncated by parser)
42  browser_tests                       0x01b4dc7e void testing::internal::HandleExceptionsInMethodIfSupported<testing:: (truncated by parser)
43  browser_tests                       0x01b439b8 testing::Test::Run() + 152
44  browser_tests                       0x01b43e77 testing::TestInfo::Run() + 263
45  browser_tests                       0x01b443f9 testing::TestCase::Run() + 265
46  browser_tests                       0x01b49755 testing::internal::UnitTestImpl::RunAllTests() + 821
47  browser_tests                       0x01b54df1 bool testing::internal::HandleSehExceptionsInMethodIfSupported<testin (truncated by parser)
48  browser_tests                       0x01b4fade bool testing::internal::HandleExceptionsInMethodIfSupported<testing:: (truncated by parser)
49  browser_tests                       0x01b493e4 testing::UnitTest::Run() + 148
50  browser_tests                       0x03d1af48 base::TestSuite::Run() + 248
51  browser_tests                       0x00b89e42 ChromeTestLauncherDelegate::RunTestSuite(int, char**) + 82
52  browser_tests                       0x01bdde7b content::LaunchTests(content::TestLauncherDelegate*, int, char**) + 1 (truncated by parser)
53  browser_tests                       0x00b89b77 main + 87
54  browser_tests                       0x00151ff5 start + 53
55  ???                                 0x00000009 0x0 + 9
[0122/152911:ERROR:process_util_posix.cc(297)] Unable to terminate process group 2763: No such process
objc[2881]: Class MockCrApp is implemented in both /Volumes/data/b/build/slave/Mac_10_7_Tests__dbg__4_/build/src/xcodebu (truncated by parser)
Note: Google Test filter = PrerenderBrowserTest.PrerenderServerRedirectNavigateToSecond
[==========] Running 1 test from 1 test case.
[----------] Global test environment set-up.
[----------] 1 test from PrerenderBrowserTest, where TypeParam =
full log
Jan. 22, 2013, 7 a.m. http://build.chromium.org/p/chromium.mac/json Mac 10.7 Tests (dbg)(4) 6412
[0121/225645:ERROR:test_launcher.cc(364)] Test timeout (45000 ms) exceeded for MetricsServiceTest.CrashRenderers
0   libbase.dylib                       0x0c88c1cf base::debug::StackTrace::StackTrace() + 63
1   libbase.dylib                       0x0c88c16b base::debug::StackTrace::StackTrace() + 43
2   browser_tests                       0x01c40352 _ZN12_GLOBAL__N_1L27DumpStackTraceSignalHandlerEi + 66
3   libsystem_c.dylib                   0x90fcd59b _sigtramp + 43
4   ???                                 0xffffffff 0x0 + 4294967295
5   browser_tests                       0x03080bd7 PrefValueStore::GetValueFromStore(char const*, PrefValueStore::PrefSt (truncated by parser)
6   browser_tests                       0x03080071 PrefValueStore::GetValueFromStoreWithType(char const*, base::Value::T (truncated by parser)
7   browser_tests                       0x0307ffae PrefValueStore::GetValue(std::string const&, base::Value::Type, base: (truncated by parser)
8   browser_tests                       0x0306b6bf PrefService::GetPreferenceValue(std::string const&) const + 399
9   browser_tests                       0x0306ba26 PrefService::GetInteger(char const*) const + 358
10  browser_tests                       0x007422f3 MetricsServiceTest_CrashRenderers_Test::RunTestOnMainThread() + 355
11  browser_tests                       0x03dc36e0 InProcessBrowserTest::RunTestOnMainThreadLoop() + 208
12  browser_tests                       0x01c402a7 content::BrowserTestBase::ProxyRunTestOnMainThreadLoop() + 119
13  browser_tests                       0x01c40d74 base::internal::RunnableAdapter<void (content::BrowserTestBase::*)()> (truncated by parser)
14  browser_tests                       0x01c40c73 base::internal::InvokeHelper<false, void, base::internal::RunnableAda (truncated by parser)
15  browser_tests                       0x01c40bbc base::internal::Invoker<1, base::internal::BindState<base::internal:: (truncated by parser)
16  browser_tests                       0x002f77eb base::Callback<void ()()>::Run() const + 75
17  browser_tests                       0x027f40d4 ChromeBrowserMainParts::PreMainMessageLoopRunImpl() + 6436
18  browser_tests                       0x027f272e ChromeBrowserMainParts::PreMainMessageLoopRun() + 46
19  libcontent.dylib                    0x0f01ab13 content::BrowserMainLoop::CreateThreads() + 1219
20  libcontent.dylib                    0x0f0239a7 content::BrowserMainRunnerImpl::Initialize(content::MainFunctionParam (truncated by parser)
21  libcontent.dylib                    0x0f0190eb content::BrowserMain(content::MainFunctionParams const&) + 139
22  browser_tests                       0x01c401e7 content::BrowserTestBase::SetUp() + 535
23  browser_tests                       0x03dc24e1 InProcessBrowserTest::SetUp() + 1953
24  browser_tests                       0x01c36591 void testing::internal::HandleSehExceptionsInMethodIfSupported<testin (truncated by parser)
25  browser_tests                       0x01c2d94e void testing::internal::HandleExceptionsInMethodIfSupported<testing:: (truncated by parser)
26  browser_tests                       0x01c23688 testing::Test::Run() + 152
27  browser_tests                       0x01c23b47 testing::TestInfo::Run() + 263
28  browser_tests                       0x01c240c9 testing::TestCase::Run() + 265
29  browser_tests                       0x01c29425 testing::internal::UnitTestImpl::RunAllTests() + 821
30  browser_tests                       0x01c34ac1 bool testing::internal::HandleSehExceptionsInMethodIfSupported<testin (truncated by parser)
31  browser_tests                       0x01c2f7ae bool testing::internal::HandleExceptionsInMethodIfSupported<testing:: (truncated by parser)
32  browser_tests                       0x01c290b4 testing::UnitTest::Run() + 148
33  browser_tests                       0x03df0488 base::TestSuite::Run() + 248
34  browser_tests                       0x00c68812 ChromeTestLauncherDelegate::RunTestSuite(int, char**) + 82
35  browser_tests                       0x01cbdb4b content::LaunchTests(content::TestLauncherDelegate*, int, char**) + 1 (truncated by parser)
36  browser_tests                       0x00c68547 main + 87
37  browser_tests                       0x00230c75 start + 53
[0121/225646:ERROR:process_util_posix.cc(297)] Unable to terminate process group 2795: No such process
objc[2928]: Class MockCrApp is implemented in both /Volumes/data/b/build/slave/Mac_10_7_Tests__dbg__4_/build/src/xcodebu (truncated by parser)
Note: Google Test filter = PrerenderBrowserTest.PrerenderServerRedirectNavigateToSecond
[==========] Running 1 test from 1 test case.
[----------] Global test environment set-up.
[----------] 1 test from PrerenderBrowserTest, where TypeParam =
full log
Jan. 21, 2013, 7:52 p.m. http://build.chromium.org/p/chromium.mac/json Mac10.7 Tests (2) 7960
[0121/114653:ERROR:test_launcher.cc(364)] Test timeout (30000 ms) exceeded for MetricsServiceTest.CrashRenderers
0   browser_tests                       0x01c0022a browser_tests + 28533290
1   browser_tests                       0x02a2e261 browser_tests + 43401825
2   libsystem_c.dylib                   0x90fcd59b _sigtramp + 43
3   ???                                 0xffffffff 0x0 + 4294967295
4   libsystem_kernel.dylib              0x9980e966 mach_port_extract_member + 161
5   CoreFoundation                      0x9c28aded __CFRunLoopRun + 1501
6   CoreFoundation                      0x9c28a47c CFRunLoopRunSpecific + 332
7   CoreFoundation                      0x9c28a328 CFRunLoopRunInMode + 120
8   HIToolbox                           0x9013a17f RunCurrentEventLoopInMode + 318
9   HIToolbox                           0x90141412 ReceiveNextEventCommon + 168
10  HIToolbox                           0x90141356 BlockUntilNextEventMatchingListInMode + 88
11  AppKit                              0x962aba9c _DPSNextEvent + 678
12  AppKit                              0x962ab306 -[NSApplication nextEventMatchingMask:untilDate:inMode:dequeue:] + 11 (truncated by parser)
13  AppKit                              0x962a7675 -[NSApplication run] + 911
14  browser_tests                       0x01beb1b7 browser_tests + 28447159
15  browser_tests                       0x01beac0c browser_tests + 28445708
16  browser_tests                       0x01c2e581 browser_tests + 28722561
17  browser_tests                       0x01c5312e browser_tests + 28873006
18  browser_tests                       0x02abda3d browser_tests + 43989565
19  browser_tests                       0x02abdaef browser_tests + 43989743
20  browser_tests                       0x0088e815 browser_tests + 8144917
21  browser_tests                       0x01bba0f0 browser_tests + 28246256
22  browser_tests                       0x02a2e411 browser_tests + 43402257
23  browser_tests                       0x00f5779b browser_tests + 15259547
24  browser_tests                       0x00f562e3 browser_tests + 15254243
25  browser_tests                       0x017ce01a browser_tests + 24133658
26  browser_tests                       0x017d186d browser_tests + 24148077
27  browser_tests                       0x017cd39d browser_tests + 24130461
28  browser_tests                       0x02a2e144 browser_tests + 43401540
29  browser_tests                       0x01bb8ea4 browser_tests + 28241572
30  browser_tests                       0x02374b32 browser_tests + 36350770
31  browser_tests                       0x0236d140 browser_tests + 36319552
32  browser_tests                       0x0236d704 browser_tests + 36321028
33  browser_tests                       0x0236db1b browser_tests + 36322075
34  browser_tests                       0x02372fab browser_tests + 36343723
35  browser_tests                       0x023750a2 browser_tests + 36352162
36  browser_tests                       0x02372bcf browser_tests + 36342735
37  browser_tests                       0x01cba84c browser_tests + 29296716
38  browser_tests                       0x00d9923b browser_tests + 13431355
39  browser_tests                       0x02aaf658 browser_tests + 43931224
40  browser_tests                       0x00d991a5 browser_tests + 13431205
41  browser_tests                       0x00130ea5 browser_tests + 421541
Note: Google Test filter = PreservedWindowPlacementIsMigrated.Test
[==========] Running 1 test from 1 test case.
[----------] Global test environment set-up.
[----------] 1 test from PreservedWindowPlacementIsMigrated, where TypeParam =
full log
Jan. 21, 2013, 6:53 p.m. http://build.chromium.org/p/chromium.win/json Win7 Tests (dbg)(4) 15164
[5048:4248:0121/103821:1879983:ERROR:textfield.h(159)] NOT IMPLEMENTED
[0121/103857:ERROR:test_launcher.cc(364)] Test timeout (45000 ms) exceeded for MetricsServiceTest.CrashRenderers
Note: Google Test filter = TranslateManagerTest.ContextMenu
[==========] Running 1 test from 1 test case.
[----------] Global test environment set-up.
[----------] 1 test from TranslateManagerTest
full log
Jan. 20, 2013, 8:26 a.m. http://build.chromium.org/p/chromium.mac/json Mac10.7 Tests (2) 7928
Note: Google Test filter = PreservedWindowPlacementIsMigrated.Test
[==========] Running 1 test from 1 test case.
[----------] Global test environment set-up.
[----------] 1 test from PreservedWindowPlacementIsMigrated, where TypeParam =
full log
Jan. 19, 2013, 10:25 a.m. http://build.chromium.org/p/chromium.mac/json Mac10.6 Tests (2) 31603
[0119/022127:ERROR:test_launcher.cc(364)] Test timeout (30000 ms) exceeded for MetricsServiceTest.CrashRenderers
0   browser_tests                       0x1a88952a 0x0 + 445158698
1   browser_tests                       0x1b6d6b41 0x0 + 460155713
2   libSystem.B.dylib                   0x9570705b _sigtramp + 43
3   ???                                 0xffffffff 0x0 + 4294967295
4   libSystem.B.dylib                   0x956c90ee mach_port_extract_member + 133
5   CoreFoundation                      0x997f211f __CFRunLoopRun + 5727
6   CoreFoundation                      0x997f03c4 CFRunLoopRunSpecific + 452
7   CoreFoundation                      0x997f01f1 CFRunLoopRunInMode + 97
8   HIToolbox                           0x9397fe04 RunCurrentEventLoopInMode + 392
9   HIToolbox                           0x9397fbb9 ReceiveNextEventCommon + 354
10  HIToolbox                           0x9397fa3e BlockUntilNextEventMatchingListInMode + 81
11  AppKit                              0x9144c595 _DPSNextEvent + 847
12  AppKit                              0x9144bdd6 -[NSApplication nextEventMatchingMask:untilDate:inMode:dequeue:] + 15 (truncated by parser)
13  AppKit                              0x9140e1f3 -[NSApplication run] + 821
14  browser_tests                       0x1a86da27 0x0 + 445045287
15  browser_tests                       0x1a86d47c 0x0 + 445043836
16  browser_tests                       0x1a8b46c1 0x0 + 445335233
17  browser_tests                       0x1a8dadfe 0x0 + 445492734
18  browser_tests                       0x1b77977d 0x0 + 460822397
19  browser_tests                       0x1b77982f 0x0 + 460822575
20  browser_tests                       0x19520fb5 0x0 + 424808373
21  browser_tests                       0x1a8414e0 0x0 + 444863712
22  browser_tests                       0x1b6d6cf1 0x0 + 460156145
23  browser_tests                       0x19be8a3b 0x0 + 431917627
24  browser_tests                       0x19be7583 0x0 + 431912323
25  browser_tests                       0x1a477d2a 0x0 + 440892714
26  browser_tests                       0x1a47d15d 0x0 + 440914269
27  browser_tests                       0x1a4770ad 0x0 + 440889517
28  browser_tests                       0x1b6d6a24 0x0 + 460155428
29  browser_tests                       0x1a840294 0x0 + 444859028
30  browser_tests                       0x1aff9972 0x0 + 452958578
31  browser_tests                       0x1aff1f80 0x0 + 452927360
32  browser_tests                       0x1aff2544 0x0 + 452928836
33  browser_tests                       0x1aff295b 0x0 + 452929883
34  browser_tests                       0x1aff7deb 0x0 + 452951531
35  browser_tests                       0x1aff9ee2 0x0 + 452959970
36  browser_tests                       0x1aff7a0f 0x0 + 452950543
37  browser_tests                       0x1a944eac 0x0 + 445927084
38  browser_tests                       0x19a2ba2b 0x0 + 430094891
39  browser_tests                       0x1b75b2c8 0x0 + 460698312
40  browser_tests                       0x19a2b995 0x0 + 430094741
41  browser_tests                       0x18dc45c5 0x0 + 417088965
Note: Google Test filter = PreservedWindowPlacementIsMigrated.Test
[==========] Running 1 test from 1 test case.
[----------] Global test environment set-up.
[----------] 1 test from PreservedWindowPlacementIsMigrated, where TypeParam =
full log
Jan. 18, 2013, 8:53 p.m. http://build.chromium.org/p/chromium.mac/json Mac10.7 Tests (2) 7902
[0118/124754:ERROR:test_launcher.cc(364)] Test timeout (30000 ms) exceeded for MetricsServiceTest.CrashRenderers
0   browser_tests                       0x01c483ba browser_tests + 28869562
1   browser_tests                       0x02a7cc31 browser_tests + 43764785
2   libsystem_c.dylib                   0x90fcd59b _sigtramp + 43
3   ???                                 0xffffffff 0x0 + 4294967295
4   libsystem_kernel.dylib              0x9980e966 mach_port_extract_member + 161
5   CoreFoundation                      0x9c28aded __CFRunLoopRun + 1501
6   CoreFoundation                      0x9c28a47c CFRunLoopRunSpecific + 332
7   CoreFoundation                      0x9c28a328 CFRunLoopRunInMode + 120
8   HIToolbox                           0x9013a17f RunCurrentEventLoopInMode + 318
9   HIToolbox                           0x901414e7 ReceiveNextEventCommon + 381
10  HIToolbox                           0x90141356 BlockUntilNextEventMatchingListInMode + 88
11  AppKit                              0x962aba9c _DPSNextEvent + 678
12  AppKit                              0x962ab306 -[NSApplication nextEventMatchingMask:untilDate:inMode:dequeue:] + 11 (truncated by parser)
13  AppKit                              0x962a7675 -[NSApplication run] + 911
14  browser_tests                       0x01c31097 browser_tests + 28774551
15  browser_tests                       0x01c30aec browser_tests + 28773100
16  browser_tests                       0x01c79771 browser_tests + 29071217
17  browser_tests                       0x01c9e2ae browser_tests + 29221550
18  browser_tests                       0x02b0c1dd browser_tests + 44351965
19  browser_tests                       0x02b0c28f browser_tests + 44352143
20  browser_tests                       0x00887be5 browser_tests + 8158181
21  browser_tests                       0x01c04fe0 browser_tests + 28594144
22  browser_tests                       0x02a7cde1 browser_tests + 43765217
23  browser_tests                       0x00f507ab browser_tests + 15271851
24  browser_tests                       0x00f4f2f3 browser_tests + 15266547
25  browser_tests                       0x01824eda browser_tests + 24530650
26  browser_tests                       0x0182c5cd browser_tests + 24561101
27  browser_tests                       0x0182425d browser_tests + 24527453
28  browser_tests                       0x02a7cb14 browser_tests + 43764500
29  browser_tests                       0x01c03d94 browser_tests + 28589460
30  browser_tests                       0x023bd9c2 browser_tests + 36690370
31  browser_tests                       0x023b5fd0 browser_tests + 36659152
32  browser_tests                       0x023b6594 browser_tests + 36660628
33  browser_tests                       0x023b69ab browser_tests + 36661675
34  browser_tests                       0x023bbe3b browser_tests + 36683323
35  browser_tests                       0x023bdf32 browser_tests + 36691762
36  browser_tests                       0x023bba5f browser_tests + 36682335
37  browser_tests                       0x01d087fc browser_tests + 29657084
38  browser_tests                       0x00d91ebb browser_tests + 13442747
39  browser_tests                       0x02afdb58 browser_tests + 44292952
40  browser_tests                       0x00d91e25 browser_tests + 13442597
41  browser_tests                       0x00124b25 browser_tests + 412453
42  ???                                 0x00000009 0x0 + 9
Note: Google Test filter = PreservedWindowPlacementIsMigrated.Test
[==========] Running 1 test from 1 test case.
[----------] Global test environment set-up.
[----------] 1 test from PreservedWindowPlacementIsMigrated, where TypeParam =
full log
Jan. 18, 2013, 5:43 p.m. http://build.chromium.org/p/chromium.mac/json Mac10.7 Tests (2) 7889
[0118/093732:ERROR:test_launcher.cc(364)] Test timeout (30000 ms) exceeded for MetricsServiceTest.CrashRenderers
0   browser_tests                       0x01c2505a browser_tests + 28868698
1   browser_tests                       0x02a58391 browser_tests + 43758481
2   libsystem_c.dylib                   0x90fcd59b _sigtramp + 43
3   ???                                 0xffffffff 0x0 + 4294967295
4   libobjc.A.dylib                     0x9b22b9ea objc_lookUpClass + 37
5   CoreFoundation                      0x9c29f4f2 _CFXNotificationPost + 1426
6   Foundation                          0x9bbfd012 -[NSNotificationCenter postNotificationName:object:userInfo:] + 92
7   Foundation                          0x9bc122a6 -[NSNotificationCenter postNotificationName:object:] + 55
8   AppKit                              0x9631b3cc -[NSWindow update] + 74
9   CoreFoundation                      0x9c2f228a -[NSObject performSelector:] + 58
10  CoreFoundation                      0x9c2f6c75 -[NSArray makeObjectsPerformSelector:] + 709
11  AppKit                              0x962add5b -[NSApplication(NSWindowCache) _updateWindowsUsingCache] + 461
12  AppKit                              0x962adb0b -[NSApplication updateWindows] + 93
13  AppKit                              0x962ada4c __-[NSApplication setWindowsNeedUpdate:]_block_invoke_2 + 73
14  CoreFoundation                      0x9c2ebf8d _runLoopObserverWithBlockContext + 29
15  CoreFoundation                      0x9c2b847e __CFRUNLOOP_IS_CALLING_OUT_TO_AN_OBSERVER_CALLBACK_FUNCTION__ + 30
16  CoreFoundation                      0x9c2b83bd __CFRunLoopDoObservers + 413
17  CoreFoundation                      0x9c28ac24 __CFRunLoopRun + 1044
18  CoreFoundation                      0x9c28a47c CFRunLoopRunSpecific + 332
19  CoreFoundation                      0x9c28a328 CFRunLoopRunInMode + 120
20  HIToolbox                           0x9013a17f RunCurrentEventLoopInMode + 318

(trimmed by parser)

36  browser_tests                       0x00f2bfa3 browser_tests + 15265699
37  browser_tests                       0x01800e6a browser_tests + 24526442
38  browser_tests                       0x0180855d browser_tests + 24556893
39  browser_tests                       0x018001ed browser_tests + 24523245
40  browser_tests                       0x02a58274 browser_tests + 43758196
41  browser_tests                       0x01bdfca4 browser_tests + 28585124
42  browser_tests                       0x023998c2 browser_tests + 36686018
43  browser_tests                       0x02391ed0 browser_tests + 36654800
44  browser_tests                       0x02392494 browser_tests + 36656276
45  browser_tests                       0x023928ab browser_tests + 36657323
46  browser_tests                       0x02397d3b browser_tests + 36678971
47  browser_tests                       0x02399e32 browser_tests + 36687410
48  browser_tests                       0x0239795f browser_tests + 36677983
49  browser_tests                       0x01ce470c browser_tests + 29652748
50  browser_tests                       0x00d6eb6b browser_tests + 13441899
51  browser_tests                       0x02ad92b8 browser_tests + 44286648
52  browser_tests                       0x00d6ead5 browser_tests + 13441749
53  browser_tests                       0x00101ae5 browser_tests + 412389
54  ???                                 0x00000009 0x0 + 9
Note: Google Test filter = PreservedWindowPlacementIsMigrated.Test
[==========] Running 1 test from 1 test case.
[----------] Global test environment set-up.
[----------] 1 test from PreservedWindowPlacementIsMigrated, where TypeParam =
full log
Jan. 18, 2013, 4:05 a.m. http://build.chromium.org/p/chromium.mac/json Mac 10.7 Tests (dbg)(3) 6644
[0117/195910:ERROR:test_launcher.cc(364)] Test timeout (45000 ms) exceeded for MetricsServiceTest.CrashRenderers
0   libbase.dylib                       0x0c74c9ef base::debug::StackTrace::StackTrace() + 63
1   libbase.dylib                       0x0c74c98b base::debug::StackTrace::StackTrace() + 43
2   browser_tests                       0x01b467d2 _ZN12_GLOBAL__N_1L27DumpStackTraceSignalHandlerEi + 66
3   libsystem_c.dylib                   0x90fcd59b _sigtramp + 43
4   ???                                 0xffffffff 0x0 + 4294967295
5   libsystem_kernel.dylib              0x9980ea83 mach_port_insert_member + 161
6   CoreFoundation                      0x9c28ad34 __CFRunLoopRun + 1316
7   CoreFoundation                      0x9c28a47c CFRunLoopRunSpecific + 332
8   CoreFoundation                      0x9c28a328 CFRunLoopRunInMode + 120
9   HIToolbox                           0x9013a17f RunCurrentEventLoopInMode + 318
10  HIToolbox                           0x901414e7 ReceiveNextEventCommon + 381
11  HIToolbox                           0x90141356 BlockUntilNextEventMatchingListInMode + 88
12  AppKit                              0x962aba9c _DPSNextEvent + 678
13  AppKit                              0x962ab306 -[NSApplication nextEventMatchingMask:untilDate:inMode:dequeue:] + 11 (truncated by parser)
14  AppKit                              0x962a7675 -[NSApplication run] + 911
15  libbase.dylib                       0x0c71495e base::MessagePumpNSApplication::DoRun(base::MessagePump::Delegate*) + (truncated by parser)
16  libbase.dylib                       0x0c713798 base::MessagePumpCFRunLoopBase::Run(base::MessagePump::Delegate*) + 1 (truncated by parser)
17  libbase.dylib                       0x0c7c8682 MessageLoop::RunInternal() + 290
18  libbase.dylib                       0x0c7c853b MessageLoop::RunHandler() + 43
19  libbase.dylib                       0x0c836158 base::RunLoop::Run() + 72
20  browser_tests                       0x01bce7af content::RunThisRunLoop(base::RunLoop*) + 111

(trimmed by parser)

35  browser_tests                       0x01b46667 content::BrowserTestBase::SetUp() + 535
36  browser_tests                       0x03cc8471 InProcessBrowserTest::SetUp() + 1953
37  browser_tests                       0x01b3ca11 void testing::internal::HandleSehExceptionsInMethodIfSupported<testin (truncated by parser)
38  browser_tests                       0x01b33dce void testing::internal::HandleExceptionsInMethodIfSupported<testing:: (truncated by parser)
39  browser_tests                       0x01b29b08 testing::Test::Run() + 152
40  browser_tests                       0x01b29fc7 testing::TestInfo::Run() + 263
41  browser_tests                       0x01b2a549 testing::TestCase::Run() + 265
42  browser_tests                       0x01b2f8a5 testing::internal::UnitTestImpl::RunAllTests() + 821
43  browser_tests                       0x01b3af41 bool testing::internal::HandleSehExceptionsInMethodIfSupported<testin (truncated by parser)
44  browser_tests                       0x01b35c2e bool testing::internal::HandleExceptionsInMethodIfSupported<testing:: (truncated by parser)
45  browser_tests                       0x01b2f534 testing::UnitTest::Run() + 148
46  browser_tests                       0x03cf6338 base::TestSuite::Run() + 248
47  browser_tests                       0x00b8abf2 ChromeTestLauncherDelegate::RunTestSuite(int, char**) + 82
48  browser_tests                       0x01bc406b content::LaunchTests(content::TestLauncherDelegate*, int, char**) + 1 (truncated by parser)
49  browser_tests                       0x00b8a927 main + 87
50  browser_tests                       0x00155c45 start + 53
51  ???                                 0x00000009 0x0 + 9
[0117/195910:ERROR:process_util_posix.cc(297)] Unable to terminate process group 3725: No such process
objc[3853]: Class MockCrApp is implemented in both /Volumes/data/b/build/slave/Mac_10_7_Tests__dbg__3_/build/src/xcodebu (truncated by parser)
Note: Google Test filter = PrerenderBrowserTest.PrerenderServerRedirectNavigateToSecond
[==========] Running 1 test from 1 test case.
[----------] Global test environment set-up.
[----------] 1 test from PrerenderBrowserTest, where TypeParam =
full log
Jan. 17, 2013, 11:01 p.m. http://build.chromium.org/p/chromium.mac/json Mac 10.7 Tests (dbg)(3) 6631
[0117/145536:ERROR:test_launcher.cc(364)] Test timeout (45000 ms) exceeded for MetricsServiceTest.CrashRenderers
0   libbase.dylib                       0x0c7769ef base::debug::StackTrace::StackTrace() + 63
1   libbase.dylib                       0x0c77698b base::debug::StackTrace::StackTrace() + 43
2   browser_tests                       0x01b91e72 _ZN12_GLOBAL__N_1L27DumpStackTraceSignalHandlerEi + 66
3   libsystem_c.dylib                   0x90fcd59b _sigtramp + 43
4   ???                                 0xffffffff 0x0 + 4294967295
5   libsystem_kernel.dylib              0x9980ea83 mach_port_insert_member + 161
6   CoreFoundation                      0x9c28ad34 __CFRunLoopRun + 1316
7   CoreFoundation                      0x9c28a47c CFRunLoopRunSpecific + 332
8   CoreFoundation                      0x9c28a328 CFRunLoopRunInMode + 120
9   HIToolbox                           0x9013a17f RunCurrentEventLoopInMode + 318
10  HIToolbox                           0x901414e7 ReceiveNextEventCommon + 381
11  HIToolbox                           0x90141356 BlockUntilNextEventMatchingListInMode + 88
12  AppKit                              0x962aba9c _DPSNextEvent + 678
13  AppKit                              0x962ab306 -[NSApplication nextEventMatchingMask:untilDate:inMode:dequeue:] + 11 (truncated by parser)
14  AppKit                              0x962a7675 -[NSApplication run] + 911
15  libbase.dylib                       0x0c73e95e base::MessagePumpNSApplication::DoRun(base::MessagePump::Delegate*) + (truncated by parser)
16  libbase.dylib                       0x0c73d798 base::MessagePumpCFRunLoopBase::Run(base::MessagePump::Delegate*) + 1 (truncated by parser)
17  libbase.dylib                       0x0c7f2682 MessageLoop::RunInternal() + 290
18  libbase.dylib                       0x0c7f253b MessageLoop::RunHandler() + 43
19  libbase.dylib                       0x0c860158 base::RunLoop::Run() + 72
20  browser_tests                       0x01c19e4f content::RunThisRunLoop(base::RunLoop*) + 111

(trimmed by parser)

34  libcontent.dylib                    0x0ef3f17b content::BrowserMain(content::MainFunctionParams const&) + 139
35  browser_tests                       0x01b91d07 content::BrowserTestBase::SetUp() + 535
36  browser_tests                       0x03d13561 InProcessBrowserTest::SetUp() + 1953
37  browser_tests                       0x01b880b1 void testing::internal::HandleSehExceptionsInMethodIfSupported<testin (truncated by parser)
38  browser_tests                       0x01b7f46e void testing::internal::HandleExceptionsInMethodIfSupported<testing:: (truncated by parser)
39  browser_tests                       0x01b751a8 testing::Test::Run() + 152
40  browser_tests                       0x01b75667 testing::TestInfo::Run() + 263
41  browser_tests                       0x01b75be9 testing::TestCase::Run() + 265
42  browser_tests                       0x01b7af45 testing::internal::UnitTestImpl::RunAllTests() + 821
43  browser_tests                       0x01b865e1 bool testing::internal::HandleSehExceptionsInMethodIfSupported<testin (truncated by parser)
44  browser_tests                       0x01b812ce bool testing::internal::HandleExceptionsInMethodIfSupported<testing:: (truncated by parser)
45  browser_tests                       0x01b7abd4 testing::UnitTest::Run() + 148
46  browser_tests                       0x03d41428 base::TestSuite::Run() + 248
47  browser_tests                       0x00bd7812 ChromeTestLauncherDelegate::RunTestSuite(int, char**) + 82
48  browser_tests                       0x01c0f70b content::LaunchTests(content::TestLauncherDelegate*, int, char**) + 1 (truncated by parser)
49  browser_tests                       0x00bd7547 main + 87
50  browser_tests                       0x001a2865 start + 53
[0117/145536:ERROR:process_util_posix.cc(297)] Unable to terminate process group 3653: Operation not permitted
objc[3808]: Class MockCrApp is implemented in both /Volumes/data/b/build/slave/Mac_10_7_Tests__dbg__3_/build/src/xcodebu (truncated by parser)
Note: Google Test filter = PrerenderBrowserTest.PrerenderServerRedirectNavigateToSecond
[==========] Running 1 test from 1 test case.
[----------] Global test environment set-up.
[----------] 1 test from PrerenderBrowserTest, where TypeParam =
full log
Jan. 17, 2013, 3:50 a.m. http://build.chromium.org/p/chromium.win/json Win7 Tests (dbg)(4) 15064
[2800:4496:0116/194433:1654999:ERROR:textfield.h(159)] NOT IMPLEMENTED
browser\metrics\metrics_service_browsertest.cc(111): error: Value of: prefs->GetInteger(prefs::kStabilityRendererCrashCo (truncated by parser)
  Actual: 3
Expected: 1
full log
Jan. 17, 2013, 1:02 a.m. http://build.chromium.org/p/chromium.win/json Win7 Tests (dbg)(4) 15059
[2392:4788:0116/165010:1215668:ERROR:textfield.h(159)] NOT IMPLEMENTED
[2392:4212:0116/165014:1219647:ERROR:ipc_channel_win.cc(401)] pipe error: 232
browser\metrics\metrics_service_browsertest.cc(111): error: Value of: prefs->GetInteger(prefs::kStabilityRendererCrashCo (truncated by parser)
  Actual: 3
Expected: 1
full log
Jan. 16, 2013, 9:56 p.m. http://build.chromium.org/p/chromium.win/json Win7 Tests (dbg)(4) 15054
[2920:3056:0116/134236:1245121:ERROR:textfield.h(159)] NOT IMPLEMENTED
browser\metrics\metrics_service_browsertest.cc(111): error: Value of: prefs->GetInteger(prefs::kStabilityRendererCrashCo (truncated by parser)
  Actual: 3
Expected: 1
full log
Jan. 16, 2013, 6:10 p.m. http://build.chromium.org/p/chromium.mac/json Mac10.7 Tests (3) 7850
[0116/100950:ERROR:test_launcher.cc(364)] Test timeout (30000 ms) exceeded for MetricsServiceTest.CrashRenderers
0   browser_tests                       0x01be9aea browser_tests + 28855018
1   browser_tests                       0x029f1041 browser_tests + 43565121
2   libsystem_c.dylib                   0x90fcd59b _sigtramp + 43
3   ???                                 0xffffffff 0x0 + 4294967295
4   CoreFoundation                      0x9c28d937 uniquedName + 199
5   CoreFoundation                      0x9c29efda _CFXNotificationPost + 122
6   Foundation                          0x9bbfd012 -[NSNotificationCenter postNotificationName:object:userInfo:] + 92
7   Foundation                          0x9bc122a6 -[NSNotificationCenter postNotificationName:object:] + 55
8   AppKit                              0x962adaf9 -[NSApplication updateWindows] + 75
9   AppKit                              0x962ada4c __-[NSApplication setWindowsNeedUpdate:]_block_invoke_2 + 73
10  CoreFoundation                      0x9c2ebf8d _runLoopObserverWithBlockContext + 29
11  CoreFoundation                      0x9c2b847e __CFRUNLOOP_IS_CALLING_OUT_TO_AN_OBSERVER_CALLBACK_FUNCTION__ + 30
12  CoreFoundation                      0x9c2b83bd __CFRunLoopDoObservers + 413
13  CoreFoundation                      0x9c28ac24 __CFRunLoopRun + 1044
14  CoreFoundation                      0x9c28a47c CFRunLoopRunSpecific + 332
15  CoreFoundation                      0x9c28a328 CFRunLoopRunInMode + 120
16  HIToolbox                           0x9013a17f RunCurrentEventLoopInMode + 318
17  HIToolbox                           0x90141412 ReceiveNextEventCommon + 168
18  HIToolbox                           0x90141356 BlockUntilNextEventMatchingListInMode + 88
19  AppKit                              0x962aba9c _DPSNextEvent + 678
20  AppKit                              0x962ab306 -[NSApplication nextEventMatchingMask:untilDate:inMode:dequeue:] + 11 (truncated by parser)

(trimmed by parser)

31  browser_tests                       0x00eedf9b browser_tests + 15241115
32  browser_tests                       0x00eecae3 browser_tests + 15235811
33  browser_tests                       0x017b7b3a browser_tests + 24455994
34  browser_tests                       0x017bbaad browser_tests + 24472237
35  browser_tests                       0x017b6ebd browser_tests + 24452797
36  browser_tests                       0x029f0f24 browser_tests + 43564836
37  browser_tests                       0x01ba1744 browser_tests + 28559172
38  browser_tests                       0x02359842 browser_tests + 36653122
39  browser_tests                       0x02351e50 browser_tests + 36621904
40  browser_tests                       0x02352414 browser_tests + 36623380
41  browser_tests                       0x0235282b browser_tests + 36624427
42  browser_tests                       0x02357cbb browser_tests + 36646075
43  browser_tests                       0x02359db2 browser_tests + 36654514
44  browser_tests                       0x023578df browser_tests + 36645087
45  browser_tests                       0x01ca3c4c browser_tests + 29617228
46  browser_tests                       0x00d30edb browser_tests + 13418203
47  browser_tests                       0x02a7f628 browser_tests + 44148264
48  browser_tests                       0x00d30e45 browser_tests + 13418053
49  browser_tests                       0x000c8cd5 browser_tests + 408789
Note: Google Test filter = PreservedWindowPlacementIsMigrated.Test
[==========] Running 1 test from 1 test case.
[----------] Global test environment set-up.
[----------] 1 test from PreservedWindowPlacementIsMigrated, where TypeParam =
full log
Jan. 16, 2013, 11:40 a.m. http://build.chromium.org/p/chromium.mac/json Mac10.7 Tests (3) 7839
[0116/033948:ERROR:test_launcher.cc(364)] Test timeout (30000 ms) exceeded for MetricsServiceTest.CrashRenderers
0   browser_tests                       0x01c06e4a browser_tests + 28855882
1   browser_tests                       0x02a0d741 browser_tests + 43562817
2   libsystem_c.dylib                   0x90fcd59b _sigtramp + 43
3   ???                                 0xffffffff 0x0 + 4294967295
4   libsystem_kernel.dylib              0x9981def3 mig_get_reply_port + 12
5   libsystem_kernel.dylib              0x9980ea42 mach_port_insert_member + 96
6   CoreFoundation                      0x9c28ad34 __CFRunLoopRun + 1316
7   CoreFoundation                      0x9c28a47c CFRunLoopRunSpecific + 332
8   CoreFoundation                      0x9c28a328 CFRunLoopRunInMode + 120
9   HIToolbox                           0x9013a17f RunCurrentEventLoopInMode + 318
10  HIToolbox                           0x90141412 ReceiveNextEventCommon + 168
11  HIToolbox                           0x90141356 BlockUntilNextEventMatchingListInMode + 88
12  AppKit                              0x962aba9c _DPSNextEvent + 678
13  AppKit                              0x962ab306 -[NSApplication nextEventMatchingMask:untilDate:inMode:dequeue:] + 11 (truncated by parser)
14  AppKit                              0x962a7675 -[NSApplication run] + 911
15  browser_tests                       0x01bf1dd7 browser_tests + 28769751
16  browser_tests                       0x01bf182c browser_tests + 28768300
17  browser_tests                       0x01c34b61 browser_tests + 29043553
18  browser_tests                       0x01c590ae browser_tests + 29192366
19  browser_tests                       0x02aa04ad browser_tests + 44164269
20  browser_tests                       0x02aa055f browser_tests + 44164447

(trimmed by parser)

25  browser_tests                       0x00f0a813 browser_tests + 15239187
26  browser_tests                       0x017d43da browser_tests + 24454106
27  browser_tests                       0x017d834d browser_tests + 24470349
28  browser_tests                       0x017d375d browser_tests + 24450909
29  browser_tests                       0x02a0d624 browser_tests + 43562532
30  browser_tests                       0x01bbe3a4 browser_tests + 28558244
31  browser_tests                       0x02376762 browser_tests + 36652898
32  browser_tests                       0x0236ed70 browser_tests + 36621680
33  browser_tests                       0x0236f334 browser_tests + 36623156
34  browser_tests                       0x0236f74b browser_tests + 36624203
35  browser_tests                       0x02374bdb browser_tests + 36645851
36  browser_tests                       0x02376cd2 browser_tests + 36654290
37  browser_tests                       0x023747ff browser_tests + 36644863
38  browser_tests                       0x01cc08fc browser_tests + 29616380
39  browser_tests                       0x00d4ec0b browser_tests + 13421579
40  browser_tests                       0x02a9bd28 browser_tests + 44145960
41  browser_tests                       0x00d4eb75 browser_tests + 13421429
42  browser_tests                       0x000e6a05 browser_tests + 412165
43  ???                                 0x00000009 0x0 + 9
Note: Google Test filter = PreservedWindowPlacementIsMigrated.Test
[==========] Running 1 test from 1 test case.
[----------] Global test environment set-up.
[----------] 1 test from PreservedWindowPlacementIsMigrated, where TypeParam =
full log
Jan. 16, 2013, 12:17 a.m. http://build.chromium.org/p/chromium.win/json Win7 Tests (dbg)(4) 15021
[3960:4284:0115/160433:1242033:ERROR:textfield.h(159)] NOT IMPLEMENTED
browser\metrics\metrics_service_browsertest.cc(111): error: Value of: prefs->GetInteger(prefs::kStabilityRendererCrashCo (truncated by parser)
  Actual: 3
Expected: 1
full log
Jan. 15, 2013, 10:40 a.m. http://build.chromium.org/p/chromium.mac/json Mac10.7 Tests (3) 7761
[0115/023910:ERROR:test_launcher.cc(364)] Test timeout (30000 ms) exceeded for MetricsServiceTest.CrashRenderers
0   browser_tests                       0x01c6b7ea browser_tests + 29251562
1   browser_tests                       0x029ed6f1 browser_tests + 43415281
2   libsystem_c.dylib                   0x90fcd59b _sigtramp + 43
3   ???                                 0xffffffff 0x0 + 4294967295
4   CoreFoundation                      0x9c28a328 CFRunLoopRunInMode + 120
5   HIToolbox                           0x9013a17f RunCurrentEventLoopInMode + 318
6   HIToolbox                           0x901414e7 ReceiveNextEventCommon + 381
7   HIToolbox                           0x90141356 BlockUntilNextEventMatchingListInMode + 88
8   AppKit                              0x962aba9c _DPSNextEvent + 678
9   AppKit                              0x962ab306 -[NSApplication nextEventMatchingMask:untilDate:inMode:dequeue:] + 11 (truncated by parser)
10  AppKit                              0x962a7675 -[NSApplication run] + 911
11  browser_tests                       0x01c48397 browser_tests + 29107095
12  browser_tests                       0x01c47dec browser_tests + 29105644
13  browser_tests                       0x01ca26d1 browser_tests + 29476561
14  browser_tests                       0x01cc67ce browser_tests + 29624270
15  browser_tests                       0x02a510ed browser_tests + 43823341
16  browser_tests                       0x02a5119f browser_tests + 43823519
17  browser_tests                       0x00847e65 browser_tests + 8134245
18  browser_tests                       0x01c179d0 browser_tests + 28907984
19  browser_tests                       0x029ed8a1 browser_tests + 43415713
20  browser_tests                       0x00f1728b browser_tests + 15274635
21  browser_tests                       0x00f15dd3 browser_tests + 15269331
22  browser_tests                       0x017b3d4a browser_tests + 24304970
23  browser_tests                       0x017bd17d browser_tests + 24342909
24  browser_tests                       0x017b2e0d browser_tests + 24301069
25  browser_tests                       0x029ed5d4 browser_tests + 43414996
26  browser_tests                       0x01c16784 browser_tests + 28903300
27  browser_tests                       0x02258252 browser_tests + 35463762
28  browser_tests                       0x02250860 browser_tests + 35432544
29  browser_tests                       0x02250e24 browser_tests + 35434020
30  browser_tests                       0x0225123b browser_tests + 35435067
31  browser_tests                       0x022566cb browser_tests + 35456715
32  browser_tests                       0x022587c2 browser_tests + 35465154
33  browser_tests                       0x022562ef browser_tests + 35455727
34  browser_tests                       0x01d3644c browser_tests + 30082124
35  browser_tests                       0x00d5995b browser_tests + 13449563
36  browser_tests                       0x02a49438 browser_tests + 43791416
37  browser_tests                       0x00d598c5 browser_tests + 13449413
38  browser_tests                       0x000ea845 browser_tests + 411717
39  ???                                 0x00000009 0x0 + 9
Note: Google Test filter = PreservedWindowPlacementIsMigrated.Test
[==========] Running 1 test from 1 test case.
[----------] Global test environment set-up.
[----------] 1 test from PreservedWindowPlacementIsMigrated, where TypeParam =
full log
Jan. 15, 2013, 8:24 a.m. http://build.chromium.org/p/chromium.mac/json Mac10.7 Tests (3) 7754
[0115/002211:ERROR:test_launcher.cc(364)] Test timeout (30000 ms) exceeded for MetricsServiceTest.CrashRenderers
0   browser_tests                       0x01c1d73a browser_tests + 29247290
1   browser_tests                       0x029a1101 browser_tests + 43417857
2   libsystem_c.dylib                   0x90fcd59b _sigtramp + 43
3   ???                                 0xffffffff 0x0 + 4294967295
4   AppKit                              0x962ada4c __-[NSApplication setWindowsNeedUpdate:]_block_invoke_2 + 73
5   CoreFoundation                      0x9c2ebf8d _runLoopObserverWithBlockContext + 29
6   CoreFoundation                      0x9c2b847e __CFRUNLOOP_IS_CALLING_OUT_TO_AN_OBSERVER_CALLBACK_FUNCTION__ + 30
7   CoreFoundation                      0x9c2b83bd __CFRunLoopDoObservers + 413
8   CoreFoundation                      0x9c28ac24 __CFRunLoopRun + 1044
9   CoreFoundation                      0x9c28a47c CFRunLoopRunSpecific + 332
10  CoreFoundation                      0x9c28a328 CFRunLoopRunInMode + 120
11  HIToolbox                           0x9013a17f RunCurrentEventLoopInMode + 318
12  HIToolbox                           0x90141412 ReceiveNextEventCommon + 168
13  HIToolbox                           0x90141356 BlockUntilNextEventMatchingListInMode + 88
14  AppKit                              0x962aba9c _DPSNextEvent + 678
15  AppKit                              0x962ab306 -[NSApplication nextEventMatchingMask:untilDate:inMode:dequeue:] + 11 (truncated by parser)
16  AppKit                              0x962a7675 -[NSApplication run] + 911
17  browser_tests                       0x01bf8887 browser_tests + 29096071
18  browser_tests                       0x01bf82dc browser_tests + 29094620
19  browser_tests                       0x01c54b81 browser_tests + 29473665
20  browser_tests                       0x01c78c7e browser_tests + 29621374

(trimmed by parser)

27  browser_tests                       0x00ec73e3 browser_tests + 15262691
28  browser_tests                       0x017660ba browser_tests + 24301754
29  browser_tests                       0x0176f4ed browser_tests + 24339693
30  browser_tests                       0x0176517d browser_tests + 24297853
31  browser_tests                       0x029a0fe4 browser_tests + 43417572
32  browser_tests                       0x01bc8c34 browser_tests + 28900404
33  browser_tests                       0x02207612 browser_tests + 35448338
34  browser_tests                       0x021ffc20 browser_tests + 35417120
35  browser_tests                       0x022001e4 browser_tests + 35418596
36  browser_tests                       0x022005fb browser_tests + 35419643
37  browser_tests                       0x02205a8b browser_tests + 35441291
38  browser_tests                       0x02207b82 browser_tests + 35449730
39  browser_tests                       0x022056af browser_tests + 35440303
40  browser_tests                       0x01ce88fc browser_tests + 30079228
41  browser_tests                       0x00d0c14b browser_tests + 13447499
42  browser_tests                       0x029fcc08 browser_tests + 43793416
43  browser_tests                       0x00d0c0b5 browser_tests + 13447349
44  browser_tests                       0x0009da45 browser_tests + 412229
45  ???                                 0x00000009 0x0 + 9
Note: Google Test filter = PreservedWindowPlacementIsMigrated.Test
[==========] Running 1 test from 1 test case.
[----------] Global test environment set-up.
[----------] 1 test from PreservedWindowPlacementIsMigrated, where TypeParam =
full log
Jan. 15, 2013, 8:24 a.m. http://build.chromium.org/p/chromium.mac/json Mac10.7 Tests (3) 7754
[0115/002211:ERROR:test_launcher.cc(364)] Test timeout (30000 ms) exceeded for MetricsServiceTest.CrashRenderers
0   browser_tests                       0x01c1d73a browser_tests + 29247290
1   browser_tests                       0x029a1101 browser_tests + 43417857
2   libsystem_c.dylib                   0x90fcd59b _sigtramp + 43
3   ???                                 0xffffffff 0x0 + 4294967295
4   AppKit                              0x962ada4c __-[NSApplication setWindowsNeedUpdate:]_block_invoke_2 + 73
5   CoreFoundation                      0x9c2ebf8d _runLoopObserverWithBlockContext + 29
6   CoreFoundation                      0x9c2b847e __CFRUNLOOP_IS_CALLING_OUT_TO_AN_OBSERVER_CALLBACK_FUNCTION__ + 30
7   CoreFoundation                      0x9c2b83bd __CFRunLoopDoObservers + 413
8   CoreFoundation                      0x9c28ac24 __CFRunLoopRun + 1044
9   CoreFoundation                      0x9c28a47c CFRunLoopRunSpecific + 332
10  CoreFoundation                      0x9c28a328 CFRunLoopRunInMode + 120
11  HIToolbox                           0x9013a17f RunCurrentEventLoopInMode + 318
12  HIToolbox                           0x90141412 ReceiveNextEventCommon + 168
13  HIToolbox                           0x90141356 BlockUntilNextEventMatchingListInMode + 88
14  AppKit                              0x962aba9c _DPSNextEvent + 678
15  AppKit                              0x962ab306 -[NSApplication nextEventMatchingMask:untilDate:inMode:dequeue:] + 11 (truncated by parser)
16  AppKit                              0x962a7675 -[NSApplication run] + 911
17  browser_tests                       0x01bf8887 browser_tests + 29096071
18  browser_tests                       0x01bf82dc browser_tests + 29094620
19  browser_tests                       0x01c54b81 browser_tests + 29473665
20  browser_tests                       0x01c78c7e browser_tests + 29621374

(trimmed by parser)

27  browser_tests                       0x00ec73e3 browser_tests + 15262691
28  browser_tests                       0x017660ba browser_tests + 24301754
29  browser_tests                       0x0176f4ed browser_tests + 24339693
30  browser_tests                       0x0176517d browser_tests + 24297853
31  browser_tests                       0x029a0fe4 browser_tests + 43417572
32  browser_tests                       0x01bc8c34 browser_tests + 28900404
33  browser_tests                       0x02207612 browser_tests + 35448338
34  browser_tests                       0x021ffc20 browser_tests + 35417120
35  browser_tests                       0x022001e4 browser_tests + 35418596
36  browser_tests                       0x022005fb browser_tests + 35419643
37  browser_tests                       0x02205a8b browser_tests + 35441291
38  browser_tests                       0x02207b82 browser_tests + 35449730
39  browser_tests                       0x022056af browser_tests + 35440303
40  browser_tests                       0x01ce88fc browser_tests + 30079228
41  browser_tests                       0x00d0c14b browser_tests + 13447499
42  browser_tests                       0x029fcc08 browser_tests + 43793416
43  browser_tests                       0x00d0c0b5 browser_tests + 13447349
44  browser_tests                       0x0009da45 browser_tests + 412229
45  ???                                 0x00000009 0x0 + 9
Note: Google Test filter = PreservedWindowPlacementIsMigrated.Test
[==========] Running 1 test from 1 test case.
[----------] Global test environment set-up.
[----------] 1 test from PreservedWindowPlacementIsMigrated, where TypeParam =
full log
Jan. 12, 2013, 10:34 p.m. http://build.chromium.org/p/chromium.mac/json Mac10.7 Tests (3) 7675
[0112/143356:ERROR:test_launcher.cc(364)] Test timeout (30000 ms) exceeded for MetricsServiceTest.CrashRenderers
0   browser_tests                       0x01c418aa browser_tests + 29149354
1   browser_tests                       0x029d7bc1 browser_tests + 43396033
2   libsystem_c.dylib                   0x90fcd59b _sigtramp + 43
3   ???                                 0xffffffff 0x0 + 4294967295
4   CoreFoundation                      0x9c261462 CFArrayGetValueAtIndex + 114
5   CoreFoundation                      0x9c27f8c5 CFArrayContainsValue + 165
6   CoreFoundation                      0x9c2ad790 CFRunLoopAddObserver + 384
7   AppKit                              0x962ab1a4 -[NSApplication setWindowsNeedUpdate:] + 457
8   AppKit                              0x9631718e -[NSApplication sendEvent:] + 9051
9   browser_tests                       0x00ef6db4 browser_tests + 15211956
10  AppKit                              0x962a76d5 -[NSApplication run] + 1007
11  browser_tests                       0x01c2a9c7 browser_tests + 29055431
12  browser_tests                       0x01c2a41c browser_tests + 29053980
13  browser_tests                       0x01c799f1 browser_tests + 29379057
14  browser_tests                       0x01ca60de browser_tests + 29561054
15  browser_tests                       0x02a4665d browser_tests + 43849309
16  browser_tests                       0x02a4670f browser_tests + 43849487
17  browser_tests                       0x0082d245 browser_tests + 8094277
18  browser_tests                       0x01bfb770 browser_tests + 28862320
19  browser_tests                       0x029d7d71 browser_tests + 43396465
20  browser_tests                       0x00efc49b browser_tests + 15234203
21  browser_tests                       0x00efafe3 browser_tests + 15228899
22  browser_tests                       0x017a477a browser_tests + 24311674
23  browser_tests                       0x017a6a6d browser_tests + 24320621
24  browser_tests                       0x017a383d browser_tests + 24307773
25  browser_tests                       0x029d7aa4 browser_tests + 43395748
26  browser_tests                       0x01bfa524 browser_tests + 28857636
27  browser_tests                       0x0222a2f2 browser_tests + 35345138
28  browser_tests                       0x02222900 browser_tests + 35313920
29  browser_tests                       0x02222ec4 browser_tests + 35315396
30  browser_tests                       0x022232db browser_tests + 35316443
31  browser_tests                       0x0222876b browser_tests + 35338091
32  browser_tests                       0x0222a862 browser_tests + 35346530
33  browser_tests                       0x0222838f browser_tests + 35337103
34  browser_tests                       0x01d17b5c browser_tests + 30026588
35  browser_tests                       0x00d3bf1b browser_tests + 13397787
36  browser_tests                       0x02a362b8 browser_tests + 43782840
37  browser_tests                       0x00d3be85 browser_tests + 13397637
38  browser_tests                       0x000d9435 browser_tests + 410677
Note: Google Test filter = PreservedWindowPlacementIsMigrated.Test
[==========] Running 1 test from 1 test case.
[----------] Global test environment set-up.
[----------] 1 test from PreservedWindowPlacementIsMigrated, where TypeParam =
full log
Jan. 11, 2013, 6:25 p.m. http://build.chromium.org/p/chromium.mac/json Mac10.7 Tests (3) 7609
[0111/102428:ERROR:test_launcher.cc(364)] Test timeout (30000 ms) exceeded for MetricsServiceTest.CrashRenderers
0   browser_tests                       0x01c1903a browser_tests + 29077562
1   browser_tests                       0x029af4e1 browser_tests + 43324641
2   libsystem_c.dylib                   0x90fcd59b _sigtramp + 43
3   ???                                 0xffffffff 0x0 + 4294967295
4   HIToolbox                           0x90141412 ReceiveNextEventCommon + 168
5   HIToolbox                           0x90141356 BlockUntilNextEventMatchingListInMode + 88
6   AppKit                              0x962aba9c _DPSNextEvent + 678
7   AppKit                              0x962ab306 -[NSApplication nextEventMatchingMask:untilDate:inMode:dequeue:] + 11 (truncated by parser)
8   AppKit                              0x962a7675 -[NSApplication run] + 911
9   browser_tests                       0x01c00197 browser_tests + 28975511
10  browser_tests                       0x01bffbec browser_tests + 28974060
11  browser_tests                       0x01c592d1 browser_tests + 29340369
12  browser_tests                       0x01c7da6e browser_tests + 29489774
13  browser_tests                       0x02a2099d browser_tests + 43788701
14  browser_tests                       0x02a20a4f browser_tests + 43788879
15  browser_tests                       0x007fd0a5 browser_tests + 7991461
16  browser_tests                       0x01bd16e0 browser_tests + 28784352
17  browser_tests                       0x029af691 browser_tests + 43325073
18  browser_tests                       0x00ecd16b browser_tests + 15135083
19  browser_tests                       0x00ecbcb3 browser_tests + 15129779
20  browser_tests                       0x01776e3a browser_tests + 24219194
21  browser_tests                       0x0178709d browser_tests + 24285341
22  browser_tests                       0x01775efd browser_tests + 24215293
23  browser_tests                       0x029af3c4 browser_tests + 43324356
24  browser_tests                       0x01bd0494 browser_tests + 28779668
25  browser_tests                       0x021fa892 browser_tests + 35244178
26  browser_tests                       0x021f2ea0 browser_tests + 35212960
27  browser_tests                       0x021f3464 browser_tests + 35214436
28  browser_tests                       0x021f387b browser_tests + 35215483
29  browser_tests                       0x021f8d0b browser_tests + 35237131
30  browser_tests                       0x021fae02 browser_tests + 35245570
31  browser_tests                       0x021f892f browser_tests + 35236143
32  browser_tests                       0x01cecc0c browser_tests + 29944844
33  browser_tests                       0x00d0d19b browser_tests + 13300123
34  browser_tests                       0x02a192d8 browser_tests + 43758296
35  browser_tests                       0x00d0d105 browser_tests + 13299973
36  browser_tests                       0x000c1a45 browser_tests + 408133
Note: Google Test filter = PreservedWindowPlacementIsMigrated.Test
[==========] Running 1 test from 1 test case.
[----------] Global test environment set-up.
[----------] 1 test from PreservedWindowPlacementIsMigrated, where TypeParam =
full log
Jan. 11, 2013, 6:25 p.m. http://build.chromium.org/p/chromium.mac/json Mac10.7 Tests (3) 7609
[0111/102428:ERROR:test_launcher.cc(364)] Test timeout (30000 ms) exceeded for MetricsServiceTest.CrashRenderers
0   browser_tests                       0x01c1903a browser_tests + 29077562
1   browser_tests                       0x029af4e1 browser_tests + 43324641
2   libsystem_c.dylib                   0x90fcd59b _sigtramp + 43
3   ???                                 0xffffffff 0x0 + 4294967295
4   HIToolbox                           0x90141412 ReceiveNextEventCommon + 168
5   HIToolbox                           0x90141356 BlockUntilNextEventMatchingListInMode + 88
6   AppKit                              0x962aba9c _DPSNextEvent + 678
7   AppKit                              0x962ab306 -[NSApplication nextEventMatchingMask:untilDate:inMode:dequeue:] + 11 (truncated by parser)
8   AppKit                              0x962a7675 -[NSApplication run] + 911
9   browser_tests                       0x01c00197 browser_tests + 28975511
10  browser_tests                       0x01bffbec browser_tests + 28974060
11  browser_tests                       0x01c592d1 browser_tests + 29340369
12  browser_tests                       0x01c7da6e browser_tests + 29489774
13  browser_tests                       0x02a2099d browser_tests + 43788701
14  browser_tests                       0x02a20a4f browser_tests + 43788879
15  browser_tests                       0x007fd0a5 browser_tests + 7991461
16  browser_tests                       0x01bd16e0 browser_tests + 28784352
17  browser_tests                       0x029af691 browser_tests + 43325073
18  browser_tests                       0x00ecd16b browser_tests + 15135083
19  browser_tests                       0x00ecbcb3 browser_tests + 15129779
20  browser_tests                       0x01776e3a browser_tests + 24219194
21  browser_tests                       0x0178709d browser_tests + 24285341
22  browser_tests                       0x01775efd browser_tests + 24215293
23  browser_tests                       0x029af3c4 browser_tests + 43324356
24  browser_tests                       0x01bd0494 browser_tests + 28779668
25  browser_tests                       0x021fa892 browser_tests + 35244178
26  browser_tests                       0x021f2ea0 browser_tests + 35212960
27  browser_tests                       0x021f3464 browser_tests + 35214436
28  browser_tests                       0x021f387b browser_tests + 35215483
29  browser_tests                       0x021f8d0b browser_tests + 35237131
30  browser_tests                       0x021fae02 browser_tests + 35245570
31  browser_tests                       0x021f892f browser_tests + 35236143
32  browser_tests                       0x01cecc0c browser_tests + 29944844
33  browser_tests                       0x00d0d19b browser_tests + 13300123
34  browser_tests                       0x02a192d8 browser_tests + 43758296
35  browser_tests                       0x00d0d105 browser_tests + 13299973
36  browser_tests                       0x000c1a45 browser_tests + 408133
Note: Google Test filter = PreservedWindowPlacementIsMigrated.Test
[==========] Running 1 test from 1 test case.
[----------] Global test environment set-up.
[----------] 1 test from PreservedWindowPlacementIsMigrated, where TypeParam =
full log
Jan. 11, 2013, 2:47 p.m. http://build.chromium.org/p/chromium.mac/json Mac10.7 Tests (3) 7595
[0111/064710:ERROR:test_launcher.cc(364)] Test timeout (30000 ms) exceeded for MetricsServiceTest.CrashRenderers
0   browser_tests                       0x01ca789a browser_tests + 29079706
1   browser_tests                       0x02a3b8e1 browser_tests + 43317473
2   libsystem_c.dylib                   0x90fcd59b _sigtramp + 43
3   ???                                 0xffffffff 0x0 + 4294967295
4   AppKit                              0x962ab409 -[NSApplication nextEventMatchingMask:untilDate:inMode:dequeue:] + 37 (truncated by parser)
5   AppKit                              0x962a7675 -[NSApplication run] + 911
6   browser_tests                       0x01c8e9f7 browser_tests + 28977655
7   browser_tests                       0x01c8e44c browser_tests + 28976204
8   browser_tests                       0x01ce7b31 browser_tests + 29342513
9   browser_tests                       0x01d0c2ce browser_tests + 29491918
10  browser_tests                       0x02aadd8d browser_tests + 43785613
11  browser_tests                       0x02aade3f browser_tests + 43785791
12  browser_tests                       0x0088b875 browser_tests + 7993461
13  browser_tests                       0x01c5ff40 browser_tests + 28786496
14  browser_tests                       0x02a3ba91 browser_tests + 43317905
15  browser_tests                       0x00f5b93b browser_tests + 15137083
16  browser_tests                       0x00f5a483 browser_tests + 15131779
17  browser_tests                       0x018042aa browser_tests + 24216234
18  browser_tests                       0x018158bd browser_tests + 24287421
19  browser_tests                       0x0180336d browser_tests + 24212333
20  browser_tests                       0x02a3b7c4 browser_tests + 43317188
21  browser_tests                       0x01c5ecf4 browser_tests + 28781812
22  browser_tests                       0x02289392 browser_tests + 35246994
23  browser_tests                       0x022819a0 browser_tests + 35215776
24  browser_tests                       0x02281f64 browser_tests + 35217252
25  browser_tests                       0x0228237b browser_tests + 35218299
26  browser_tests                       0x0228780b browser_tests + 35239947
27  browser_tests                       0x02289902 browser_tests + 35248386
28  browser_tests                       0x0228742f browser_tests + 35238959
29  browser_tests                       0x01d7b46c browser_tests + 29946988
30  browser_tests                       0x00d9b96b browser_tests + 13302123
31  browser_tests                       0x02aa7788 browser_tests + 43759496
32  browser_tests                       0x00d9b8d5 browser_tests + 13301973
33  browser_tests                       0x00150215 browser_tests + 410133
Note: Google Test filter = PreservedWindowPlacementIsMigrated.Test
[==========] Running 1 test from 1 test case.
[----------] Global test environment set-up.
[----------] 1 test from PreservedWindowPlacementIsMigrated, where TypeParam =
full log
Jan. 11, 2013, 2:47 p.m. http://build.chromium.org/p/chromium.mac/json Mac10.7 Tests (3) 7595
[0111/064710:ERROR:test_launcher.cc(364)] Test timeout (30000 ms) exceeded for MetricsServiceTest.CrashRenderers
0   browser_tests                       0x01ca789a browser_tests + 29079706
1   browser_tests                       0x02a3b8e1 browser_tests + 43317473
2   libsystem_c.dylib                   0x90fcd59b _sigtramp + 43
3   ???                                 0xffffffff 0x0 + 4294967295
4   AppKit                              0x962ab409 -[NSApplication nextEventMatchingMask:untilDate:inMode:dequeue:] + 37 (truncated by parser)
5   AppKit                              0x962a7675 -[NSApplication run] + 911
6   browser_tests                       0x01c8e9f7 browser_tests + 28977655
7   browser_tests                       0x01c8e44c browser_tests + 28976204
8   browser_tests                       0x01ce7b31 browser_tests + 29342513
9   browser_tests                       0x01d0c2ce browser_tests + 29491918
10  browser_tests                       0x02aadd8d browser_tests + 43785613
11  browser_tests                       0x02aade3f browser_tests + 43785791
12  browser_tests                       0x0088b875 browser_tests + 7993461
13  browser_tests                       0x01c5ff40 browser_tests + 28786496
14  browser_tests                       0x02a3ba91 browser_tests + 43317905
15  browser_tests                       0x00f5b93b browser_tests + 15137083
16  browser_tests                       0x00f5a483 browser_tests + 15131779
17  browser_tests                       0x018042aa browser_tests + 24216234
18  browser_tests                       0x018158bd browser_tests + 24287421
19  browser_tests                       0x0180336d browser_tests + 24212333
20  browser_tests                       0x02a3b7c4 browser_tests + 43317188
21  browser_tests                       0x01c5ecf4 browser_tests + 28781812
22  browser_tests                       0x02289392 browser_tests + 35246994
23  browser_tests                       0x022819a0 browser_tests + 35215776
24  browser_tests                       0x02281f64 browser_tests + 35217252
25  browser_tests                       0x0228237b browser_tests + 35218299
26  browser_tests                       0x0228780b browser_tests + 35239947
27  browser_tests                       0x02289902 browser_tests + 35248386
28  browser_tests                       0x0228742f browser_tests + 35238959
29  browser_tests                       0x01d7b46c browser_tests + 29946988
30  browser_tests                       0x00d9b96b browser_tests + 13302123
31  browser_tests                       0x02aa7788 browser_tests + 43759496
32  browser_tests                       0x00d9b8d5 browser_tests + 13301973
33  browser_tests                       0x00150215 browser_tests + 410133
Note: Google Test filter = PreservedWindowPlacementIsMigrated.Test
[==========] Running 1 test from 1 test case.
[----------] Global test environment set-up.
[----------] 1 test from PreservedWindowPlacementIsMigrated, where TypeParam =
full log
Jan. 11, 2013, 2:47 p.m. http://build.chromium.org/p/chromium.mac/json Mac10.7 Tests (3) 7595
[0111/064710:ERROR:test_launcher.cc(364)] Test timeout (30000 ms) exceeded for MetricsServiceTest.CrashRenderers
0   browser_tests                       0x01ca789a browser_tests + 29079706
1   browser_tests                       0x02a3b8e1 browser_tests + 43317473
2   libsystem_c.dylib                   0x90fcd59b _sigtramp + 43
3   ???                                 0xffffffff 0x0 + 4294967295
4   AppKit                              0x962ab409 -[NSApplication nextEventMatchingMask:untilDate:inMode:dequeue:] + 37 (truncated by parser)
5   AppKit                              0x962a7675 -[NSApplication run] + 911
6   browser_tests                       0x01c8e9f7 browser_tests + 28977655
7   browser_tests                       0x01c8e44c browser_tests + 28976204
8   browser_tests                       0x01ce7b31 browser_tests + 29342513
9   browser_tests                       0x01d0c2ce browser_tests + 29491918
10  browser_tests                       0x02aadd8d browser_tests + 43785613
11  browser_tests                       0x02aade3f browser_tests + 43785791
12  browser_tests                       0x0088b875 browser_tests + 7993461
13  browser_tests                       0x01c5ff40 browser_tests + 28786496
14  browser_tests                       0x02a3ba91 browser_tests + 43317905
15  browser_tests                       0x00f5b93b browser_tests + 15137083
16  browser_tests                       0x00f5a483 browser_tests + 15131779
17  browser_tests                       0x018042aa browser_tests + 24216234
18  browser_tests                       0x018158bd browser_tests + 24287421
19  browser_tests                       0x0180336d browser_tests + 24212333
20  browser_tests                       0x02a3b7c4 browser_tests + 43317188
21  browser_tests                       0x01c5ecf4 browser_tests + 28781812
22  browser_tests                       0x02289392 browser_tests + 35246994
23  browser_tests                       0x022819a0 browser_tests + 35215776
24  browser_tests                       0x02281f64 browser_tests + 35217252
25  browser_tests                       0x0228237b browser_tests + 35218299
26  browser_tests                       0x0228780b browser_tests + 35239947
27  browser_tests                       0x02289902 browser_tests + 35248386
28  browser_tests                       0x0228742f browser_tests + 35238959
29  browser_tests                       0x01d7b46c browser_tests + 29946988
30  browser_tests                       0x00d9b96b browser_tests + 13302123
31  browser_tests                       0x02aa7788 browser_tests + 43759496
32  browser_tests                       0x00d9b8d5 browser_tests + 13301973
33  browser_tests                       0x00150215 browser_tests + 410133
Note: Google Test filter = PreservedWindowPlacementIsMigrated.Test
[==========] Running 1 test from 1 test case.
[----------] Global test environment set-up.
[----------] 1 test from PreservedWindowPlacementIsMigrated, where TypeParam =
full log
Jan. 11, 2013, 12:28 p.m. http://build.chromium.org/p/chromium.mac/json Mac10.7 Tests (3) 7588
[0111/042732:ERROR:test_launcher.cc(364)] Test timeout (30000 ms) exceeded for MetricsServiceTest.CrashRenderers
0   browser_tests                       0x01c4195a browser_tests + 29137242
1   browser_tests                       0x029c44f1 browser_tests + 43304177
2   libsystem_c.dylib                   0x90fcd59b _sigtramp + 43
3   ???                                 0xffffffff 0x0 + 4294967295
4   CoreFoundation                      0x9c28b218 __CFRunLoopRun + 2568
5   CoreFoundation                      0x9c28a47c CFRunLoopRunSpecific + 332
6   CoreFoundation                      0x9c28a328 CFRunLoopRunInMode + 120
7   HIToolbox                           0x9013a17f RunCurrentEventLoopInMode + 318
8   HIToolbox                           0x90141412 ReceiveNextEventCommon + 168
9   HIToolbox                           0x90141356 BlockUntilNextEventMatchingListInMode + 88
10  AppKit                              0x962aba9c _DPSNextEvent + 678
11  AppKit                              0x962ab306 -[NSApplication nextEventMatchingMask:untilDate:inMode:dequeue:] + 11 (truncated by parser)
12  AppKit                              0x962a7675 -[NSApplication run] + 911
13  browser_tests                       0x01c1e537 browser_tests + 28992823
14  browser_tests                       0x01c1df8c browser_tests + 28991372
15  browser_tests                       0x01c799d1 browser_tests + 29366737
16  browser_tests                       0x01c9c40e browser_tests + 29508622
17  browser_tests                       0x02a3704d browser_tests + 43774029
18  browser_tests                       0x02a370ff browser_tests + 43774207
19  browser_tests                       0x008172b5 browser_tests + 7991989
20  browser_tests                       0x01bef5d0 browser_tests + 28800464
21  browser_tests                       0x029c46a1 browser_tests + 43304609
22  browser_tests                       0x00ee742b browser_tests + 15135787
23  browser_tests                       0x00ee5f73 browser_tests + 15130483
24  browser_tests                       0x0178759a browser_tests + 24180122
25  browser_tests                       0x017901cd browser_tests + 24216013
26  browser_tests                       0x0178665d browser_tests + 24176221
27  browser_tests                       0x029c43d4 browser_tests + 43303892
28  browser_tests                       0x01bee384 browser_tests + 28795780
29  browser_tests                       0x022172c2 browser_tests + 35254978
30  browser_tests                       0x0220f8d0 browser_tests + 35223760
31  browser_tests                       0x0220fe94 browser_tests + 35225236
32  browser_tests                       0x022102ab browser_tests + 35226283
33  browser_tests                       0x0221573b browser_tests + 35247931
34  browser_tests                       0x02217832 browser_tests + 35256370
35  browser_tests                       0x0221535f browser_tests + 35246943
36  browser_tests                       0x01d0e4dc browser_tests + 29975772
37  browser_tests                       0x00d2693b browser_tests + 13297979
38  browser_tests                       0x02a27668 browser_tests + 43710056
39  browser_tests                       0x00d268a5 browser_tests + 13297829
40  browser_tests                       0x000dbbe5 browser_tests + 408549
Note: Google Test filter = PreservedWindowPlacementIsMigrated.Test
[==========] Running 1 test from 1 test case.
[----------] Global test environment set-up.
[----------] 1 test from PreservedWindowPlacementIsMigrated, where TypeParam =
full log
Jan. 11, 2013, 12:28 p.m. http://build.chromium.org/p/chromium.mac/json Mac10.7 Tests (3) 7588
[0111/042732:ERROR:test_launcher.cc(364)] Test timeout (30000 ms) exceeded for MetricsServiceTest.CrashRenderers
0   browser_tests                       0x01c4195a browser_tests + 29137242
1   browser_tests                       0x029c44f1 browser_tests + 43304177
2   libsystem_c.dylib                   0x90fcd59b _sigtramp + 43
3   ???                                 0xffffffff 0x0 + 4294967295
4   CoreFoundation                      0x9c28b218 __CFRunLoopRun + 2568
5   CoreFoundation                      0x9c28a47c CFRunLoopRunSpecific + 332
6   CoreFoundation                      0x9c28a328 CFRunLoopRunInMode + 120
7   HIToolbox                           0x9013a17f RunCurrentEventLoopInMode + 318
8   HIToolbox                           0x90141412 ReceiveNextEventCommon + 168
9   HIToolbox                           0x90141356 BlockUntilNextEventMatchingListInMode + 88
10  AppKit                              0x962aba9c _DPSNextEvent + 678
11  AppKit                              0x962ab306 -[NSApplication nextEventMatchingMask:untilDate:inMode:dequeue:] + 11 (truncated by parser)
12  AppKit                              0x962a7675 -[NSApplication run] + 911
13  browser_tests                       0x01c1e537 browser_tests + 28992823
14  browser_tests                       0x01c1df8c browser_tests + 28991372
15  browser_tests                       0x01c799d1 browser_tests + 29366737
16  browser_tests                       0x01c9c40e browser_tests + 29508622
17  browser_tests                       0x02a3704d browser_tests + 43774029
18  browser_tests                       0x02a370ff browser_tests + 43774207
19  browser_tests                       0x008172b5 browser_tests + 7991989
20  browser_tests                       0x01bef5d0 browser_tests + 28800464
21  browser_tests                       0x029c46a1 browser_tests + 43304609
22  browser_tests                       0x00ee742b browser_tests + 15135787
23  browser_tests                       0x00ee5f73 browser_tests + 15130483
24  browser_tests                       0x0178759a browser_tests + 24180122
25  browser_tests                       0x017901cd browser_tests + 24216013
26  browser_tests                       0x0178665d browser_tests + 24176221
27  browser_tests                       0x029c43d4 browser_tests + 43303892
28  browser_tests                       0x01bee384 browser_tests + 28795780
29  browser_tests                       0x022172c2 browser_tests + 35254978
30  browser_tests                       0x0220f8d0 browser_tests + 35223760
31  browser_tests                       0x0220fe94 browser_tests + 35225236
32  browser_tests                       0x022102ab browser_tests + 35226283
33  browser_tests                       0x0221573b browser_tests + 35247931
34  browser_tests                       0x02217832 browser_tests + 35256370
35  browser_tests                       0x0221535f browser_tests + 35246943
36  browser_tests                       0x01d0e4dc browser_tests + 29975772
37  browser_tests                       0x00d2693b browser_tests + 13297979
38  browser_tests                       0x02a27668 browser_tests + 43710056
39  browser_tests                       0x00d268a5 browser_tests + 13297829
40  browser_tests                       0x000dbbe5 browser_tests + 408549
Note: Google Test filter = PreservedWindowPlacementIsMigrated.Test
[==========] Running 1 test from 1 test case.
[----------] Global test environment set-up.
[----------] 1 test from PreservedWindowPlacementIsMigrated, where TypeParam =
full log
Jan. 11, 2013, 12:28 p.m. http://build.chromium.org/p/chromium.mac/json Mac10.7 Tests (3) 7588
[0111/042732:ERROR:test_launcher.cc(364)] Test timeout (30000 ms) exceeded for MetricsServiceTest.CrashRenderers
0   browser_tests                       0x01c4195a browser_tests + 29137242
1   browser_tests                       0x029c44f1 browser_tests + 43304177
2   libsystem_c.dylib                   0x90fcd59b _sigtramp + 43
3   ???                                 0xffffffff 0x0 + 4294967295
4   CoreFoundation                      0x9c28b218 __CFRunLoopRun + 2568
5   CoreFoundation                      0x9c28a47c CFRunLoopRunSpecific + 332
6   CoreFoundation                      0x9c28a328 CFRunLoopRunInMode + 120
7   HIToolbox                           0x9013a17f RunCurrentEventLoopInMode + 318
8   HIToolbox                           0x90141412 ReceiveNextEventCommon + 168
9   HIToolbox                           0x90141356 BlockUntilNextEventMatchingListInMode + 88
10  AppKit                              0x962aba9c _DPSNextEvent + 678
11  AppKit                              0x962ab306 -[NSApplication nextEventMatchingMask:untilDate:inMode:dequeue:] + 11 (truncated by parser)
12  AppKit                              0x962a7675 -[NSApplication run] + 911
13  browser_tests                       0x01c1e537 browser_tests + 28992823
14  browser_tests                       0x01c1df8c browser_tests + 28991372
15  browser_tests                       0x01c799d1 browser_tests + 29366737
16  browser_tests                       0x01c9c40e browser_tests + 29508622
17  browser_tests                       0x02a3704d browser_tests + 43774029
18  browser_tests                       0x02a370ff browser_tests + 43774207
19  browser_tests                       0x008172b5 browser_tests + 7991989
20  browser_tests                       0x01bef5d0 browser_tests + 28800464
21  browser_tests                       0x029c46a1 browser_tests + 43304609
22  browser_tests                       0x00ee742b browser_tests + 15135787
23  browser_tests                       0x00ee5f73 browser_tests + 15130483
24  browser_tests                       0x0178759a browser_tests + 24180122
25  browser_tests                       0x017901cd browser_tests + 24216013
26  browser_tests                       0x0178665d browser_tests + 24176221
27  browser_tests                       0x029c43d4 browser_tests + 43303892
28  browser_tests                       0x01bee384 browser_tests + 28795780
29  browser_tests                       0x022172c2 browser_tests + 35254978
30  browser_tests                       0x0220f8d0 browser_tests + 35223760
31  browser_tests                       0x0220fe94 browser_tests + 35225236
32  browser_tests                       0x022102ab browser_tests + 35226283
33  browser_tests                       0x0221573b browser_tests + 35247931
34  browser_tests                       0x02217832 browser_tests + 35256370
35  browser_tests                       0x0221535f browser_tests + 35246943
36  browser_tests                       0x01d0e4dc browser_tests + 29975772
37  browser_tests                       0x00d2693b browser_tests + 13297979
38  browser_tests                       0x02a27668 browser_tests + 43710056
39  browser_tests                       0x00d268a5 browser_tests + 13297829
40  browser_tests                       0x000dbbe5 browser_tests + 408549
Note: Google Test filter = PreservedWindowPlacementIsMigrated.Test
[==========] Running 1 test from 1 test case.
[----------] Global test environment set-up.
[----------] 1 test from PreservedWindowPlacementIsMigrated, where TypeParam =
full log
Jan. 10, 2013, 7:06 p.m. http://build.chromium.org/p/chromium.mac/json Mac10.7 Tests (3) 7528
[0110/110548:ERROR:test_launcher.cc(364)] Test timeout (30000 ms) exceeded for MetricsServiceTest.CrashRenderers
0   browser_tests                       0x01baa9ba browser_tests + 28989882
1   browser_tests                       0x0292d031 browser_tests + 43155505
2   libsystem_c.dylib                   0x90fcd59b _sigtramp + 43
3   ???                                 0xffffffff 0x0 + 4294967295
4   libsystem_kernel.dylib              0x9980ea83 mach_port_insert_member + 161
5   CoreFoundation                      0x9c28ad34 __CFRunLoopRun + 1316
6   CoreFoundation                      0x9c28a47c CFRunLoopRunSpecific + 332
7   CoreFoundation                      0x9c28a328 CFRunLoopRunInMode + 120
8   HIToolbox                           0x9013a17f RunCurrentEventLoopInMode + 318
9   HIToolbox                           0x901414e7 ReceiveNextEventCommon + 381
10  HIToolbox                           0x90141356 BlockUntilNextEventMatchingListInMode + 88
11  AppKit                              0x962aba9c _DPSNextEvent + 678
12  AppKit                              0x962ab306 -[NSApplication nextEventMatchingMask:untilDate:inMode:dequeue:] + 11 (truncated by parser)
13  AppKit                              0x962a7675 -[NSApplication run] + 911
14  browser_tests                       0x01b88027 browser_tests + 28848167
15  browser_tests                       0x01b87a7c browser_tests + 28846716
16  browser_tests                       0x01be2a31 browser_tests + 29219377
17  browser_tests                       0x01c058ae browser_tests + 29362350
18  browser_tests                       0x0299d01d browser_tests + 43614237
19  browser_tests                       0x0299d0cf browser_tests + 43614415
20  browser_tests                       0x007a6475 browser_tests + 8000629
21  browser_tests                       0x01b58630 browser_tests + 28653104
22  browser_tests                       0x0292d1e1 browser_tests + 43155937
23  browser_tests                       0x00e51f8b browser_tests + 14995339
24  browser_tests                       0x00e50ad3 browser_tests + 14990035
25  browser_tests                       0x016f9cea browser_tests + 24071402
26  browser_tests                       0x016fac3d browser_tests + 24075325
27  browser_tests                       0x016f8e0d browser_tests + 24067597
28  browser_tests                       0x0292cf14 browser_tests + 43155220
29  browser_tests                       0x01b573e4 browser_tests + 28648420
30  browser_tests                       0x021813d2 browser_tests + 35111890
31  browser_tests                       0x021799e0 browser_tests + 35080672
32  browser_tests                       0x02179fa4 browser_tests + 35082148
33  browser_tests                       0x0217a3bb browser_tests + 35083195
34  browser_tests                       0x0217f84b browser_tests + 35104843
35  browser_tests                       0x02181942 browser_tests + 35113282
36  browser_tests                       0x0217f46f browser_tests + 35103855
37  browser_tests                       0x01c7753c browser_tests + 29828412
38  browser_tests                       0x00c91c8b browser_tests + 13159563
39  browser_tests                       0x02993818 browser_tests + 43575320
40  browser_tests                       0x00c91bf5 browser_tests + 13159413
41  browser_tests                       0x00068c65 browser_tests + 408677
Note: Google Test filter = PreservedWindowPlacementIsMigrated.Test
[==========] Running 1 test from 1 test case.
[----------] Global test environment set-up.
[----------] 1 test from PreservedWindowPlacementIsMigrated, where TypeParam =
full log
Jan. 10, 2013, 7:06 p.m. http://build.chromium.org/p/chromium.mac/json Mac10.7 Tests (3) 7528
[0110/110548:ERROR:test_launcher.cc(364)] Test timeout (30000 ms) exceeded for MetricsServiceTest.CrashRenderers
0   browser_tests                       0x01baa9ba browser_tests + 28989882
1   browser_tests                       0x0292d031 browser_tests + 43155505
2   libsystem_c.dylib                   0x90fcd59b _sigtramp + 43
3   ???                                 0xffffffff 0x0 + 4294967295
4   libsystem_kernel.dylib              0x9980ea83 mach_port_insert_member + 161
5   CoreFoundation                      0x9c28ad34 __CFRunLoopRun + 1316
6   CoreFoundation                      0x9c28a47c CFRunLoopRunSpecific + 332
7   CoreFoundation                      0x9c28a328 CFRunLoopRunInMode + 120
8   HIToolbox                           0x9013a17f RunCurrentEventLoopInMode + 318
9   HIToolbox                           0x901414e7 ReceiveNextEventCommon + 381
10  HIToolbox                           0x90141356 BlockUntilNextEventMatchingListInMode + 88
11  AppKit                              0x962aba9c _DPSNextEvent + 678
12  AppKit                              0x962ab306 -[NSApplication nextEventMatchingMask:untilDate:inMode:dequeue:] + 11 (truncated by parser)
13  AppKit                              0x962a7675 -[NSApplication run] + 911
14  browser_tests                       0x01b88027 browser_tests + 28848167
15  browser_tests                       0x01b87a7c browser_tests + 28846716
16  browser_tests                       0x01be2a31 browser_tests + 29219377
17  browser_tests                       0x01c058ae browser_tests + 29362350
18  browser_tests                       0x0299d01d browser_tests + 43614237
19  browser_tests                       0x0299d0cf browser_tests + 43614415
20  browser_tests                       0x007a6475 browser_tests + 8000629
21  browser_tests                       0x01b58630 browser_tests + 28653104
22  browser_tests                       0x0292d1e1 browser_tests + 43155937
23  browser_tests                       0x00e51f8b browser_tests + 14995339
24  browser_tests                       0x00e50ad3 browser_tests + 14990035
25  browser_tests                       0x016f9cea browser_tests + 24071402
26  browser_tests                       0x016fac3d browser_tests + 24075325
27  browser_tests                       0x016f8e0d browser_tests + 24067597
28  browser_tests                       0x0292cf14 browser_tests + 43155220
29  browser_tests                       0x01b573e4 browser_tests + 28648420
30  browser_tests                       0x021813d2 browser_tests + 35111890
31  browser_tests                       0x021799e0 browser_tests + 35080672
32  browser_tests                       0x02179fa4 browser_tests + 35082148
33  browser_tests                       0x0217a3bb browser_tests + 35083195
34  browser_tests                       0x0217f84b browser_tests + 35104843
35  browser_tests                       0x02181942 browser_tests + 35113282
36  browser_tests                       0x0217f46f browser_tests + 35103855
37  browser_tests                       0x01c7753c browser_tests + 29828412
38  browser_tests                       0x00c91c8b browser_tests + 13159563
39  browser_tests                       0x02993818 browser_tests + 43575320
40  browser_tests                       0x00c91bf5 browser_tests + 13159413
41  browser_tests                       0x00068c65 browser_tests + 408677
Note: Google Test filter = PreservedWindowPlacementIsMigrated.Test
[==========] Running 1 test from 1 test case.
[----------] Global test environment set-up.
[----------] 1 test from PreservedWindowPlacementIsMigrated, where TypeParam =
full log
Jan. 10, 2013, 7:06 p.m. http://build.chromium.org/p/chromium.mac/json Mac10.7 Tests (3) 7528
[0110/110548:ERROR:test_launcher.cc(364)] Test timeout (30000 ms) exceeded for MetricsServiceTest.CrashRenderers
0   browser_tests                       0x01baa9ba browser_tests + 28989882
1   browser_tests                       0x0292d031 browser_tests + 43155505
2   libsystem_c.dylib                   0x90fcd59b _sigtramp + 43
3   ???                                 0xffffffff 0x0 + 4294967295
4   libsystem_kernel.dylib              0x9980ea83 mach_port_insert_member + 161
5   CoreFoundation                      0x9c28ad34 __CFRunLoopRun + 1316
6   CoreFoundation                      0x9c28a47c CFRunLoopRunSpecific + 332
7   CoreFoundation                      0x9c28a328 CFRunLoopRunInMode + 120
8   HIToolbox                           0x9013a17f RunCurrentEventLoopInMode + 318
9   HIToolbox                           0x901414e7 ReceiveNextEventCommon + 381
10  HIToolbox                           0x90141356 BlockUntilNextEventMatchingListInMode + 88
11  AppKit                              0x962aba9c _DPSNextEvent + 678
12  AppKit                              0x962ab306 -[NSApplication nextEventMatchingMask:untilDate:inMode:dequeue:] + 11 (truncated by parser)
13  AppKit                              0x962a7675 -[NSApplication run] + 911
14  browser_tests                       0x01b88027 browser_tests + 28848167
15  browser_tests                       0x01b87a7c browser_tests + 28846716
16  browser_tests                       0x01be2a31 browser_tests + 29219377
17  browser_tests                       0x01c058ae browser_tests + 29362350
18  browser_tests                       0x0299d01d browser_tests + 43614237
19  browser_tests                       0x0299d0cf browser_tests + 43614415
20  browser_tests                       0x007a6475 browser_tests + 8000629
21  browser_tests                       0x01b58630 browser_tests + 28653104
22  browser_tests                       0x0292d1e1 browser_tests + 43155937
23  browser_tests                       0x00e51f8b browser_tests + 14995339
24  browser_tests                       0x00e50ad3 browser_tests + 14990035
25  browser_tests                       0x016f9cea browser_tests + 24071402
26  browser_tests                       0x016fac3d browser_tests + 24075325
27  browser_tests                       0x016f8e0d browser_tests + 24067597
28  browser_tests                       0x0292cf14 browser_tests + 43155220
29  browser_tests                       0x01b573e4 browser_tests + 28648420
30  browser_tests                       0x021813d2 browser_tests + 35111890
31  browser_tests                       0x021799e0 browser_tests + 35080672
32  browser_tests                       0x02179fa4 browser_tests + 35082148
33  browser_tests                       0x0217a3bb browser_tests + 35083195
34  browser_tests                       0x0217f84b browser_tests + 35104843
35  browser_tests                       0x02181942 browser_tests + 35113282
36  browser_tests                       0x0217f46f browser_tests + 35103855
37  browser_tests                       0x01c7753c browser_tests + 29828412
38  browser_tests                       0x00c91c8b browser_tests + 13159563
39  browser_tests                       0x02993818 browser_tests + 43575320
40  browser_tests                       0x00c91bf5 browser_tests + 13159413
41  browser_tests                       0x00068c65 browser_tests + 408677
Note: Google Test filter = PreservedWindowPlacementIsMigrated.Test
[==========] Running 1 test from 1 test case.
[----------] Global test environment set-up.
[----------] 1 test from PreservedWindowPlacementIsMigrated, where TypeParam =
full log
Jan. 10, 2013, 7:06 p.m. http://build.chromium.org/p/chromium.mac/json Mac10.7 Tests (3) 7528
[0110/110548:ERROR:test_launcher.cc(364)] Test timeout (30000 ms) exceeded for MetricsServiceTest.CrashRenderers
0   browser_tests                       0x01baa9ba browser_tests + 28989882
1   browser_tests                       0x0292d031 browser_tests + 43155505
2   libsystem_c.dylib                   0x90fcd59b _sigtramp + 43
3   ???                                 0xffffffff 0x0 + 4294967295
4   libsystem_kernel.dylib              0x9980ea83 mach_port_insert_member + 161
5   CoreFoundation                      0x9c28ad34 __CFRunLoopRun + 1316
6   CoreFoundation                      0x9c28a47c CFRunLoopRunSpecific + 332
7   CoreFoundation                      0x9c28a328 CFRunLoopRunInMode + 120
8   HIToolbox                           0x9013a17f RunCurrentEventLoopInMode + 318
9   HIToolbox                           0x901414e7 ReceiveNextEventCommon + 381
10  HIToolbox                           0x90141356 BlockUntilNextEventMatchingListInMode + 88
11  AppKit                              0x962aba9c _DPSNextEvent + 678
12  AppKit                              0x962ab306 -[NSApplication nextEventMatchingMask:untilDate:inMode:dequeue:] + 11 (truncated by parser)
13  AppKit                              0x962a7675 -[NSApplication run] + 911
14  browser_tests                       0x01b88027 browser_tests + 28848167
15  browser_tests                       0x01b87a7c browser_tests + 28846716
16  browser_tests                       0x01be2a31 browser_tests + 29219377
17  browser_tests                       0x01c058ae browser_tests + 29362350
18  browser_tests                       0x0299d01d browser_tests + 43614237
19  browser_tests                       0x0299d0cf browser_tests + 43614415
20  browser_tests                       0x007a6475 browser_tests + 8000629
21  browser_tests                       0x01b58630 browser_tests + 28653104
22  browser_tests                       0x0292d1e1 browser_tests + 43155937
23  browser_tests                       0x00e51f8b browser_tests + 14995339
24  browser_tests                       0x00e50ad3 browser_tests + 14990035
25  browser_tests                       0x016f9cea browser_tests + 24071402
26  browser_tests                       0x016fac3d browser_tests + 24075325
27  browser_tests                       0x016f8e0d browser_tests + 24067597
28  browser_tests                       0x0292cf14 browser_tests + 43155220
29  browser_tests                       0x01b573e4 browser_tests + 28648420
30  browser_tests                       0x021813d2 browser_tests + 35111890
31  browser_tests                       0x021799e0 browser_tests + 35080672
32  browser_tests                       0x02179fa4 browser_tests + 35082148
33  browser_tests                       0x0217a3bb browser_tests + 35083195
34  browser_tests                       0x0217f84b browser_tests + 35104843
35  browser_tests                       0x02181942 browser_tests + 35113282
36  browser_tests                       0x0217f46f browser_tests + 35103855
37  browser_tests                       0x01c7753c browser_tests + 29828412
38  browser_tests                       0x00c91c8b browser_tests + 13159563
39  browser_tests                       0x02993818 browser_tests + 43575320
40  browser_tests                       0x00c91bf5 browser_tests + 13159413
41  browser_tests                       0x00068c65 browser_tests + 408677
Note: Google Test filter = PreservedWindowPlacementIsMigrated.Test
[==========] Running 1 test from 1 test case.
[----------] Global test environment set-up.
[----------] 1 test from PreservedWindowPlacementIsMigrated, where TypeParam =
full log
Jan. 10, 2013, 7:06 p.m. http://build.chromium.org/p/chromium.mac/json Mac10.7 Tests (3) 7528
[0110/110548:ERROR:test_launcher.cc(364)] Test timeout (30000 ms) exceeded for MetricsServiceTest.CrashRenderers
0   browser_tests                       0x01baa9ba browser_tests + 28989882
1   browser_tests                       0x0292d031 browser_tests + 43155505
2   libsystem_c.dylib                   0x90fcd59b _sigtramp + 43
3   ???                                 0xffffffff 0x0 + 4294967295
4   libsystem_kernel.dylib              0x9980ea83 mach_port_insert_member + 161
5   CoreFoundation                      0x9c28ad34 __CFRunLoopRun + 1316
6   CoreFoundation                      0x9c28a47c CFRunLoopRunSpecific + 332
7   CoreFoundation                      0x9c28a328 CFRunLoopRunInMode + 120
8   HIToolbox                           0x9013a17f RunCurrentEventLoopInMode + 318
9   HIToolbox                           0x901414e7 ReceiveNextEventCommon + 381
10  HIToolbox                           0x90141356 BlockUntilNextEventMatchingListInMode + 88
11  AppKit                              0x962aba9c _DPSNextEvent + 678
12  AppKit                              0x962ab306 -[NSApplication nextEventMatchingMask:untilDate:inMode:dequeue:] + 11 (truncated by parser)
13  AppKit                              0x962a7675 -[NSApplication run] + 911
14  browser_tests                       0x01b88027 browser_tests + 28848167
15  browser_tests                       0x01b87a7c browser_tests + 28846716
16  browser_tests                       0x01be2a31 browser_tests + 29219377
17  browser_tests                       0x01c058ae browser_tests + 29362350
18  browser_tests                       0x0299d01d browser_tests + 43614237
19  browser_tests                       0x0299d0cf browser_tests + 43614415
20  browser_tests                       0x007a6475 browser_tests + 8000629
21  browser_tests                       0x01b58630 browser_tests + 28653104
22  browser_tests                       0x0292d1e1 browser_tests + 43155937
23  browser_tests                       0x00e51f8b browser_tests + 14995339
24  browser_tests                       0x00e50ad3 browser_tests + 14990035
25  browser_tests                       0x016f9cea browser_tests + 24071402
26  browser_tests                       0x016fac3d browser_tests + 24075325
27  browser_tests                       0x016f8e0d browser_tests + 24067597
28  browser_tests                       0x0292cf14 browser_tests + 43155220
29  browser_tests                       0x01b573e4 browser_tests + 28648420
30  browser_tests                       0x021813d2 browser_tests + 35111890
31  browser_tests                       0x021799e0 browser_tests + 35080672
32  browser_tests                       0x02179fa4 browser_tests + 35082148
33  browser_tests                       0x0217a3bb browser_tests + 35083195
34  browser_tests                       0x0217f84b browser_tests + 35104843
35  browser_tests                       0x02181942 browser_tests + 35113282
36  browser_tests                       0x0217f46f browser_tests + 35103855
37  browser_tests                       0x01c7753c browser_tests + 29828412
38  browser_tests                       0x00c91c8b browser_tests + 13159563
39  browser_tests                       0x02993818 browser_tests + 43575320
40  browser_tests                       0x00c91bf5 browser_tests + 13159413
41  browser_tests                       0x00068c65 browser_tests + 408677
Note: Google Test filter = PreservedWindowPlacementIsMigrated.Test
[==========] Running 1 test from 1 test case.
[----------] Global test environment set-up.
[----------] 1 test from PreservedWindowPlacementIsMigrated, where TypeParam =
full log
Jan. 9, 2013, 6:27 p.m. http://build.chromium.org/p/chromium.mac/json Mac10.7 Tests (3) 7469
[0109/102330:ERROR:test_launcher.cc(364)] Test timeout (30000 ms) exceeded for MetricsServiceTest.CrashRenderers
0   browser_tests                       0x01c8e6da browser_tests + 29079258
1   browser_tests                       0x029ec741 browser_tests + 43095873
2   libsystem_c.dylib                   0x90fcd59b _sigtramp + 43
3   ???                                 0xffffffff 0x0 + 4294967295
4   libsystem_kernel.dylib              0x9980ea83 mach_port_insert_member + 161
5   CoreFoundation                      0x9c28ad34 __CFRunLoopRun + 1316
6   CoreFoundation                      0x9c28a47c CFRunLoopRunSpecific + 332
7   CoreFoundation                      0x9c28a328 CFRunLoopRunInMode + 120
8   HIToolbox                           0x9013a17f RunCurrentEventLoopInMode + 318
9   HIToolbox                           0x90141412 ReceiveNextEventCommon + 168
10  HIToolbox                           0x90141356 BlockUntilNextEventMatchingListInMode + 88
11  AppKit                              0x962aba9c _DPSNextEvent + 678
12  AppKit                              0x962ab306 -[NSApplication nextEventMatchingMask:untilDate:inMode:dequeue:] + 11 (truncated by parser)
13  AppKit                              0x962a7675 -[NSApplication run] + 911
14  browser_tests                       0x01c75237 browser_tests + 28975671
15  browser_tests                       0x01c74c8c browser_tests + 28974220
16  browser_tests                       0x01cc2ef1 browser_tests + 29294321
17  browser_tests                       0x01d0b78e browser_tests + 29591438
18  browser_tests                       0x02a57f0d browser_tests + 43536141
19  browser_tests                       0x02a57fbf browser_tests + 43536319
20  browser_tests                       0x00870e75 browser_tests + 7986805
21  browser_tests                       0x01c35080 browser_tests + 28713088
22  browser_tests                       0x029ec8f1 browser_tests + 43096305
23  browser_tests                       0x00f1c858 browser_tests + 14981208
24  browser_tests                       0x00f1b393 browser_tests + 14975891
25  browser_tests                       0x017a4d1a browser_tests + 23928090
26  browser_tests                       0x017adf0d browser_tests + 23965453
27  browser_tests                       0x017a3e3d browser_tests + 23924285
28  browser_tests                       0x029ec624 browser_tests + 43095588
29  browser_tests                       0x01c33e34 browser_tests + 28708404
30  browser_tests                       0x0224d8d2 browser_tests + 35104978
31  browser_tests                       0x02245ee0 browser_tests + 35073760
32  browser_tests                       0x022464a4 browser_tests + 35075236
33  browser_tests                       0x022468bb browser_tests + 35076283
34  browser_tests                       0x0224bd4b browser_tests + 35097931
35  browser_tests                       0x0224de42 browser_tests + 35106370
36  browser_tests                       0x0224b96f browser_tests + 35096943
37  browser_tests                       0x01d44a0c browser_tests + 29825548
38  browser_tests                       0x00d60abb browser_tests + 13163195
39  browser_tests                       0x02a47568 browser_tests + 43468136
40  browser_tests                       0x00d60a25 browser_tests + 13163045
41  browser_tests                       0x001361f5 browser_tests + 406005
Note: Google Test filter = PreservedWindowPlacementIsMigrated.Test
[==========] Running 1 test from 1 test case.
[----------] Global test environment set-up.
[----------] 1 test from PreservedWindowPlacementIsMigrated, where TypeParam =
full log
Jan. 9, 2013, 5:27 a.m. http://build.chromium.org/p/chromium.mac/json Mac10.7 Tests (3) 7427
[0108/212235:ERROR:test_launcher.cc(364)] Test timeout (30000 ms) exceeded for MetricsServiceTest.Cr (truncated by parser)
0   browser_tests                       0x01bf9a7a browser_tests + 29063802

(trimmed by parser)

[==========] Running 1 test from 1 test case.
[----------] Global test environment set-up.
[----------] 1 test from PreservedWindowPlacementIsMigrated, where TypeParam =
full log
Jan. 8, 2013, 6:56 a.m. http://build.chromium.org/p/chromium.mac/json Mac 10.6 Tests (dbg)(3) 31135
[0107/224604:ERROR:test_launcher.cc(364)] Test timeout (45000 ms) exceeded for MetricsServiceTest.Cr (truncated by parser)
0   libbase.dylib                       0x1711799f base::debug::StackTrace::StackTrace() + 63

(trimmed by parser)

[==========] Running 1 test from 1 test case.
[----------] Global test environment set-up.
[----------] 1 test from PrerenderBrowserTest, where TypeParam =
full log
Jan. 8, 2013, 6:56 a.m. http://build.chromium.org/p/chromium.mac/json Mac 10.6 Tests (dbg)(3) 31135
[0107/224604:ERROR:test_launcher.cc(364)] Test timeout (45000 ms) exceeded for MetricsServiceTest.Cr (truncated by parser)
0   libbase.dylib                       0x1711799f base::debug::StackTrace::StackTrace() + 63

(trimmed by parser)

[==========] Running 1 test from 1 test case.
[----------] Global test environment set-up.
[----------] 1 test from PrerenderBrowserTest, where TypeParam =
full log
Jan. 8, 2013, 6:56 a.m. http://build.chromium.org/p/chromium.mac/json Mac 10.6 Tests (dbg)(3) 31135
[0107/224604:ERROR:test_launcher.cc(364)] Test timeout (45000 ms) exceeded for MetricsServiceTest.Cr (truncated by parser)
0   libbase.dylib                       0x1711799f base::debug::StackTrace::StackTrace() + 63

(trimmed by parser)

[==========] Running 1 test from 1 test case.
[----------] Global test environment set-up.
[----------] 1 test from PrerenderBrowserTest, where TypeParam =
full log
Jan. 8, 2013, 6:56 a.m. http://build.chromium.org/p/chromium.mac/json Mac 10.6 Tests (dbg)(3) 31135
[0107/224604:ERROR:test_launcher.cc(364)] Test timeout (45000 ms) exceeded for MetricsServiceTest.Cr (truncated by parser)
0   libbase.dylib                       0x1711799f base::debug::StackTrace::StackTrace() + 63

(trimmed by parser)

[==========] Running 1 test from 1 test case.
[----------] Global test environment set-up.
[----------] 1 test from PrerenderBrowserTest, where TypeParam =
full log
Jan. 7, 2013, 6:59 a.m. http://build.chromium.org/p/chromium.mac/json Mac10.7 Tests (2) 7243
[0106/225824:ERROR:test_launcher.cc(364)] Test timeout (30000 ms) exceeded for MetricsServiceTest.Cr (truncated by parser)
0   browser_tests                       0x01c54cea browser_tests + 29072618

(trimmed by parser)

[==========] Running 1 test from 1 test case.
[----------] Global test environment set-up.
[----------] 1 test from PreservedWindowPlacementIsMigrated, where TypeParam =
full log
Jan. 4, 2013, 10:45 p.m. http://build.chromium.org/p/chromium.mac/json Mac 10.7 Tests (dbg)(3) 6106
Note: Google Test filter = PrerenderBrowserTest.PrerenderServerRedirectNavigateToSecond
[==========] Running 1 test from 1 test case.
[----------] Global test environment set-up.
[----------] 1 test from PrerenderBrowserTest, where TypeParam =
full log
Jan. 4, 2013, 7:49 a.m. http://build.chromium.org/p/chromium.mac/json Mac10.7 Tests (2) 7177
[0103/234925:ERROR:test_launcher.cc(364)] Test timeout (30000 ms) exceeded for MetricsServiceTest.Cr (truncated by parser)
0   browser_tests                       0x01c7ecba browser_tests + 29265082

(trimmed by parser)

[==========] Running 1 test from 1 test case.
[----------] Global test environment set-up.
[----------] 1 test from PreservedWindowPlacementIsMigrated, where TypeParam =
full log
Jan. 4, 2013, 2:57 a.m. http://build.chromium.org/p/chromium.mac/json Mac 10.7 Tests (dbg)(3) 6071
[0103/184633:ERROR:test_launcher.cc(364)] Test timeout (45000 ms) exceeded for MetricsServiceTest.Cr (truncated by parser)
0   libbase.dylib                       0x0c6ec27f base::debug::StackTrace::StackTrace() + 63

(trimmed by parser)

[==========] Running 1 test from 1 test case.
[----------] Global test environment set-up.
[----------] 1 test from PrerenderBrowserTest, where TypeParam =
full log
Jan. 4, 2013, 2:57 a.m. http://build.chromium.org/p/chromium.mac/json Mac 10.7 Tests (dbg)(3) 6071
[0103/184633:ERROR:test_launcher.cc(364)] Test timeout (45000 ms) exceeded for MetricsServiceTest.Cr (truncated by parser)
0   libbase.dylib                       0x0c6ec27f base::debug::StackTrace::StackTrace() + 63

(trimmed by parser)

[==========] Running 1 test from 1 test case.
[----------] Global test environment set-up.
[----------] 1 test from PrerenderBrowserTest, where TypeParam =
full log
Jan. 4, 2013, 2:57 a.m. http://build.chromium.org/p/chromium.mac/json Mac 10.7 Tests (dbg)(3) 6071
[0103/184633:ERROR:test_launcher.cc(364)] Test timeout (45000 ms) exceeded for MetricsServiceTest.Cr (truncated by parser)
0   libbase.dylib                       0x0c6ec27f base::debug::StackTrace::StackTrace() + 63

(trimmed by parser)

[==========] Running 1 test from 1 test case.
[----------] Global test environment set-up.
[----------] 1 test from PrerenderBrowserTest, where TypeParam =
full log
Jan. 4, 2013, 2:57 a.m. http://build.chromium.org/p/chromium.mac/json Mac 10.7 Tests (dbg)(3) 6071
[0103/184633:ERROR:test_launcher.cc(364)] Test timeout (45000 ms) exceeded for MetricsServiceTest.Cr (truncated by parser)
0   libbase.dylib                       0x0c6ec27f base::debug::StackTrace::StackTrace() + 63

(trimmed by parser)

[==========] Running 1 test from 1 test case.
[----------] Global test environment set-up.
[----------] 1 test from PrerenderBrowserTest, where TypeParam =
full log
next page